10CGW


10CGW is registered to a White 1962, Morris Oxford with a Petrol engine. It Failed its most recent MOT Test on the 08 March 2006

9 unique faults (9 Total) reported in its MOT History (2 Tests).

0 common/recurring faults.

50% (1) MOT Pass Rate and a 50% (1) MOT Failure Rate.

12,961 recorded miles.

10CGW


10CGW is registered to a White 1962, Morris Oxford with a Petrol engine. It Failed its most recent MOT Test on the 08 March 2006

9 unique faults (9 Total) reported in its MOT History (2 Tests).

0 common/recurring faults.

50% (1) MOT Pass Rate and a 50% (1) MOT Failure Rate.

12,961 recorded miles.

MOT PASS/Failure rate for 10CGW

all MOT test results for 10CGW represented as a percentage
MOT PASS/Failure rate for 10CGW
all MOT test results for 10CGW represented as a percentage

PERCENTAGE OF VEHICLE FAULTS WITH 10CGW

ALL REPORTED FAULTS, DISPLAYED BY PERCENTAGE OF OCCURRENCE DURING ALL MOT TESTS
PERCENTAGE OF VEHICLE FAULTS WITH 10CGW
ALL REPORTED FAULTS, DISPLAYED BY PERCENTAGE OF OCCURRENCE DURING ALL MOT TESTS
ADVISORY

FAIL

USER ENTERED

10CGW annual Faults by type

ALL REPORTED FAULTS, DISPLAYED over time and categorised by type
10CGW annual Faults by type
ALL REPORTED FAULTS, DISPLAYED over time and categorised by type

ALL 10CGW ADVISORIES [1]

ALL ADVISORIES, ORDERED by OCCURRENCE DURING 10CGW's MOT HISTORY
ALL 10CGW ADVISORIES [1]
ALL ADVISORIES, ORDERED by OCCURRENCE DURING 10CGW's MOT HISTORY
Fail Faults | source www.vehiclestats.co.uk
Fault Fault Test Date Test Date/Time Reference MOT Test Reference
1 Front suspension arm rubber bush deteriorated but not resulting in excessive movement (2.4.g.2) Front suspension arm rubber bush deteriorated but not resulting in excessive movement (2.4.g.2) 23 February 2006 [09:37] 23/02/2006 134544456408 134544456408

ALL 10CGW Failure Faults [7]

ALL Failure faults, ORDERED by OCCURRENCE DURING 10CGW's MOT HISTORY
ALL 10CGW Failure Faults [7]
ALL Failure faults, ORDERED by OCCURRENCE DURING 10CGW's MOT HISTORY
Fail Faults | source www.vehiclestats.co.uk
Fault Fault Test Date Test Date/Time Reference MOT Test Reference
1 Nearside rear position lamp(s) excessively deteriorated so that it is not visible from a reasonable distance (1.1.a.3d) Nearside rear position lamp(s) excessively deteriorated so that it is not visible from a reasonable distance (1.1.a.3d) 23 February 2006 [09:37] 23/02/2006 134544456408 134544456408
1 Nearside stop lamp not working (1.2.1b) Nearside stop lamp not working (1.2.1b) 23 February 2006 [09:37] 23/02/2006 134544456408 134544456408
1 Windscreen washer provides insufficient washer liquid (8.2.3) Windscreen washer provides insufficient washer liquid (8.2.3) 23 February 2006 [09:37] 23/02/2006 134544456408 134544456408
1 Rear exhaust has a major leak of exhaust gases (7.1.2) Rear exhaust has a major leak of exhaust gases (7.1.2) 23 February 2006 [09:37] 23/02/2006 134544456408 134544456408
1 Rear brake application uneven (3.7.b.2) Rear brake application uneven (3.7.b.2) 23 February 2006 [09:37] 23/02/2006 134544456408 134544456408
1 Offside rear an item not tested (manual) Offside rear an item not tested (manual) 23 February 2006 [09:37] 23/02/2006 134544456408 134544456408
1 Parking brake: efficiency below requirements (3.7.b.7) Parking brake: efficiency below requirements (3.7.b.7) 23 February 2006 [09:37] 23/02/2006 134544456408 134544456408

ALL 10CGW User Entered Faults [1]

ALL User Entered faults, ORDERED by OCCURRENCE DURING 10CGW's MOT HISTORY
ALL 10CGW User Entered Faults [1]
ALL User Entered faults, ORDERED by OCCURRENCE DURING 10CGW's MOT HISTORY
Fail Faults | source www.vehiclestats.co.uk
Fault Fault Test Date Test Date/Time Reference MOT Test Reference
1 Extensive poorly welded repairs to underside and chassis heavily undersealed. Extensive poorly welded repairs to underside and chassis heavily undersealed. 23 February 2006 [09:37] 23/02/2006 134544456408 134544456408

MOT TEST: 08 March 2006 13:22:16 PASSED
MOT TEST: 08 March 2006 13:22:16 PASSED

This test (553537966043) was completed on the 08 March 2006 13:22:16 and PASSED the requirements for a valid MOT with 0 comments.

This test (553537966043) was completed on the 08 March 2006 13:22:16 and PASSED the requirements for a valid MOT with 0 comments.

Recorded mileage: 12,961

Recorded mileage: 12,961


MOT TEST: 23 February 2006 09:37:38 FAILED
MOT TEST: 23 February 2006 09:37:38 FAILED

This test (134544456408) was completed on the 23 February 2006 09:37:38 and FAILED the requirements for a valid MOT with 9 comments.

This test (134544456408) was completed on the 23 February 2006 09:37:38 and FAILED the requirements for a valid MOT with 9 comments.

Recorded mileage: 12,961

Recorded mileage: 12,961


ADVISORY

FAIL

USER ENTERED