123 7UR


1237UR is registered to a Blue 1961, Morris Minor 1000 with a Petrol engine. It Failed its most recent MOT Test on the 14 September 2016

22 unique faults (27 Total) reported in its MOT History (16 Tests).

5 common/recurring faults, the most frequent (2 times) is: Nearside Front lower trunnion slight play.

62% (10) MOT Pass Rate and a 38% (6) MOT Failure Rate.

96,477 recorded miles.

123 7UR


1237UR is registered to a Blue 1961, Morris Minor 1000 with a Petrol engine. It Failed its most recent MOT Test on the 14 September 2016

22 unique faults (27 Total) reported in its MOT History (16 Tests).

5 common/recurring faults, the most frequent (2 times) is: Nearside Front lower trunnion slight play.

62% (10) MOT Pass Rate and a 38% (6) MOT Failure Rate.

96,477 recorded miles.

MOT PASS/Failure rate for 123 7UR

all MOT test results for 123 7UR represented as a percentage
MOT PASS/Failure rate for 123 7UR
all MOT test results for 123 7UR represented as a percentage

PERCENTAGE OF VEHICLE FAULTS WITH 123 7UR

ALL REPORTED FAULTS, DISPLAYED BY PERCENTAGE OF OCCURRENCE DURING ALL MOT TESTS
PERCENTAGE OF VEHICLE FAULTS WITH 123 7UR
ALL REPORTED FAULTS, DISPLAYED BY PERCENTAGE OF OCCURRENCE DURING ALL MOT TESTS
ADVISORY

FAIL

USER ENTERED

PASS WITH RECTIFICATION

123 7UR annual Faults by type

ALL REPORTED FAULTS, DISPLAYED over time and categorised by type
123 7UR annual Faults by type
ALL REPORTED FAULTS, DISPLAYED over time and categorised by type

RECURRING FAULTS WITH 123 7UR

FAULTS THAT HAVE OCCURED MORE THAN ONCE DURING 123 7UR's MOT HISTORY
RECURRING FAULTS WITH 123 7UR
FAULTS THAT HAVE OCCURED MORE THAN ONCE DURING 123 7UR's MOT HISTORY
Fault Fault Test Date Test Date/Time Reference MOT Test Reference
2 Nearside front lower trunnion slight play Nearside front lower trunnion slight play 14 September 2016 [15:27] 14/09/2016 05 September 2016 [11:02] 05/09/2016 905075745130 905075745130 233816925698 233816925698
2 Offside front direction indicator not working (1.4.a.2c) Offside front direction indicator not working (1.4.a.2c) 27 January 2015 [15:44] 27/01/2015 30 April 2007 [09:13] 30/04/2007 157357425027 157357425027 473300927119 473300927119
2 Offside rear suspension spring mounting prescribed area is corroded but not considered excessive (2.4.a.3) Offside rear suspension spring mounting prescribed area is corroded but not considered excessive (2.4.a.3) 31 January 2014 [17:48] 31/01/2014 30 January 2014 [11:43] 30/01/2014 528271734094 528271734094 807580134060 807580134060
2 Nearside front axle swivel joint has slight play (2.5.a.3b) Nearside front axle swivel joint has slight play (2.5.a.3b) 31 January 2014 [17:48] 31/01/2014 30 January 2014 [11:43] 30/01/2014 528271734094 528271734094 807580134060 807580134060
2 Brakes imbalanced requirements only just met. It would appear that the braking system requires adjustment or repair. (3.7.b.5b) Brakes imbalanced requirements only just met. It would appear that the braking system requires adjustment or repair. (3.7.b.5b) 26 January 2012 [15:38] 26/01/2012 26 January 2012 [15:38] 26/01/2012 567866122018 567866122018 315776122013 315776122013

ALL 123 7UR ADVISORIES [11]

ALL ADVISORIES, ORDERED by OCCURRENCE DURING 123 7UR's MOT HISTORY
ALL 123 7UR ADVISORIES [11]
ALL ADVISORIES, ORDERED by OCCURRENCE DURING 123 7UR's MOT HISTORY
Advisory Faults | source www.vehiclestats.co.uk
Fault Fault Test Date Test Date/Time Reference MOT Test Reference
2 Nearside front lower trunnion slight play Nearside front lower trunnion slight play 14 September 2016 [15:27] 14/09/2016 05 September 2016 [11:02] 05/09/2016 905075745130 905075745130 233816925698 233816925698
2 Offside rear suspension spring mounting prescribed area is corroded but not considered excessive (2.4.a.3) Offside rear suspension spring mounting prescribed area is corroded but not considered excessive (2.4.a.3) 31 January 2014 [17:48] 31/01/2014 30 January 2014 [11:43] 30/01/2014 528271734094 528271734094 807580134060 807580134060
2 Nearside front axle swivel joint has slight play (2.5.a.3b) Nearside front axle swivel joint has slight play (2.5.a.3b) 31 January 2014 [17:48] 31/01/2014 30 January 2014 [11:43] 30/01/2014 528271734094 528271734094 807580134060 807580134060
2 Brakes imbalanced requirements only just met. It would appear that the braking system requires adjustment or repair. (3.7.b.5b) Brakes imbalanced requirements only just met. It would appear that the braking system requires adjustment or repair. (3.7.b.5b) 26 January 2012 [15:38] 26/01/2012 26 January 2012 [15:38] 26/01/2012 567866122018 567866122018 315776122013 315776122013
1 Front brakes imbalanced requirements only just met. It would appear that the braking system requires adjustment or repair. (3.7.b.5b) Front brakes imbalanced requirements only just met. It would appear that the braking system requires adjustment or repair. (3.7.b.5b) 30 January 2014 [11:43] 30/01/2014 807580134060 807580134060
1 Offside outer front lower suspension arm has slight play in a pin/bearing (2.4.g.2) Offside outer front lower suspension arm has slight play in a pin/bearing (2.4.g.2) 02 February 2010 [15:30] 02/02/2010 661823630065 661823630065
1 Offside rear torque/reaction arm has a slightly deteriorated rubber bush (2.4.g.2) Offside rear torque/reaction arm has a slightly deteriorated rubber bush (2.4.g.2) 02 February 2010 [15:30] 02/02/2010 661823630065 661823630065

ALL 123 7UR Failure Faults [12]

ALL Failure faults, ORDERED by OCCURRENCE DURING 123 7UR's MOT HISTORY
ALL 123 7UR Failure Faults [12]
ALL Failure faults, ORDERED by OCCURRENCE DURING 123 7UR's MOT HISTORY
Fail Faults | source www.vehiclestats.co.uk
Fault Fault Test Date Test Date/Time Reference MOT Test Reference
2 Offside front direction indicator not working (1.4.a.2c) Offside front direction indicator not working (1.4.a.2c) 27 January 2015 [15:44] 27/01/2015 30 April 2007 [09:13] 30/04/2007 157357425027 157357425027 473300927119 473300927119
1 Service brake: efficiency below requirements (3.7.b.7) Service brake: efficiency below requirements (3.7.b.7) 05 September 2016 [11:02] 05/09/2016 233816925698 233816925698
1 Parking brake: efficiency below requirements (3.7.b.7) Parking brake: efficiency below requirements (3.7.b.7) 05 September 2016 [11:02] 05/09/2016 233816925698 233816925698
1 Front brakes imbalanced across an axle (3.7.b.5b) Front brakes imbalanced across an axle (3.7.b.5b) 05 September 2016 [11:02] 05/09/2016 233816925698 233816925698
1 Rear brakes imbalanced across an axle axle 2 (3.7.b.5b) Rear brakes imbalanced across an axle axle 2 (3.7.b.5b) 05 September 2016 [11:02] 05/09/2016 233816925698 233816925698
1 Offside front position lamp(s) not working (1.1.a.3b) Offside front position lamp(s) not working (1.1.a.3b) 27 January 2015 [15:44] 27/01/2015 157357425027 157357425027
1 Nearside front direction indicator not working (1.4.a.2c) Nearside front direction indicator not working (1.4.a.2c) 30 January 2014 [11:43] 30/01/2014 807580134060 807580134060
1 Offside front suspension component mounting prescribed area is excessively corroded (2.4.a.3) Offside front suspension component mounting prescribed area is excessively corroded (2.4.a.3) 30 January 2014 [11:43] 30/01/2014 807580134060 807580134060
1 Offside rear direction indicator not working (1.4.a.2c) Offside rear direction indicator not working (1.4.a.2c) 30 April 2007 [09:13] 30/04/2007 473300927119 473300927119
1 Nearside front body or chassis has excessive corrosion, seriously affecting its strength within 30cm of the body mountings (6.1.b.2) Nearside front body or chassis has excessive corrosion, seriously affecting its strength within 30cm of the body mountings (6.1.b.2) 30 April 2007 [09:13] 30/04/2007 473300927119 473300927119
1 Nearside rear body or chassis has excessive corrosion, seriously affecting its strength within 30cm of the body mountings (6.1.b.2) Nearside rear body or chassis has excessive corrosion, seriously affecting its strength within 30cm of the body mountings (6.1.b.2) 03 May 2006 [10:19] 03/05/2006 412323326174 412323326174

ALL 123 7UR User Entered Faults [2]

ALL User Entered faults, ORDERED by OCCURRENCE DURING 123 7UR's MOT HISTORY
ALL 123 7UR User Entered Faults [2]
ALL User Entered faults, ORDERED by OCCURRENCE DURING 123 7UR's MOT HISTORY
User Entered Faults | source www.vehiclestats.co.uk
Fault Fault Test Date Test Date/Time Reference MOT Test Reference
1 Corrosion rear doors lower member Corrosion rear doors lower member 23 January 2013 [09:25] 23/01/2013 967233123071 967233123071
1 Rear hub oil leak Rear hub oil leak 03 May 2006 [10:19] 03/05/2006 412323326174 412323326174

ALL 123 7UR Pass With Rectification Faults [2]

ALL Pass With Rectification faults, ORDERED by OCCURRENCE DURING 123 7UR's MOT HISTORY
ALL 123 7UR Pass With Rectification Faults [2]
ALL Pass With Rectification faults, ORDERED by OCCURRENCE DURING 123 7UR's MOT HISTORY
Pass With Rectification Faults | source www.vehiclestats.co.uk
Fault Fault Test Date Test Date/Time Reference MOT Test Reference
1 Nearside headlamp not working on dipped beam (1.7.5a) Nearside headlamp not working on dipped beam (1.7.5a) 26 January 2012 [15:38] 26/01/2012 315776122013 315776122013
1 Nearside front position lamp(s) not working (1.1.a.3b) Nearside front position lamp(s) not working (1.1.a.3b) 26 January 2012 [15:38] 26/01/2012 315776122013 315776122013

MOT TEST: 14 September 2016 15:27:25 PASSED
MOT TEST: 14 September 2016 15:27:25 PASSED

This test (905075745130) was completed on the 14 September 2016 15:27:25 and PASSED the requirements for a valid MOT with 1 comments.

This test (905075745130) was completed on the 14 September 2016 15:27:25 and PASSED the requirements for a valid MOT with 1 comments.

Recorded mileage: 96,477

Recorded mileage: 96,477


ADVISORY


MOT TEST: 05 September 2016 11:02:27 FAILED
MOT TEST: 05 September 2016 11:02:27 FAILED

This test (233816925698) was completed on the 05 September 2016 11:02:27 and FAILED the requirements for a valid MOT with 5 comments.

This test (233816925698) was completed on the 05 September 2016 11:02:27 and FAILED the requirements for a valid MOT with 5 comments.

Recorded mileage: 96,475

Recorded mileage: 96,475


ADVISORY

FAIL


MOT TEST: 27 January 2015 18:36:36 PASSED
MOT TEST: 27 January 2015 18:36:36 PASSED

This test (968577925048) was completed on the 27 January 2015 18:36:36 and PASSED the requirements for a valid MOT with 0 comments.

This test (968577925048) was completed on the 27 January 2015 18:36:36 and PASSED the requirements for a valid MOT with 0 comments.

Recorded mileage: 96,138

Recorded mileage: 96,138


MOT TEST: 27 January 2015 15:44:56 FAILED
MOT TEST: 27 January 2015 15:44:56 FAILED

This test (157357425027) was completed on the 27 January 2015 15:44:56 and FAILED the requirements for a valid MOT with 2 comments.

This test (157357425027) was completed on the 27 January 2015 15:44:56 and FAILED the requirements for a valid MOT with 2 comments.

Recorded mileage: 96,138

Recorded mileage: 96,138


FAIL


MOT TEST: 31 January 2014 17:48:16 PASSED
MOT TEST: 31 January 2014 17:48:16 PASSED

This test (528271734094) was completed on the 31 January 2014 17:48:16 and PASSED the requirements for a valid MOT with 2 comments.

This test (528271734094) was completed on the 31 January 2014 17:48:16 and PASSED the requirements for a valid MOT with 2 comments.

Recorded mileage: 95,587

Recorded mileage: 95,587


ADVISORY


MOT TEST: 30 January 2014 11:43:13 FAILED
MOT TEST: 30 January 2014 11:43:13 FAILED

This test (807580134060) was completed on the 30 January 2014 11:43:13 and FAILED the requirements for a valid MOT with 5 comments.

This test (807580134060) was completed on the 30 January 2014 11:43:13 and FAILED the requirements for a valid MOT with 5 comments.

Recorded mileage: 95,587

Recorded mileage: 95,587


ADVISORY

FAIL


MOT TEST: 23 January 2013 09:25:20 PASSED
MOT TEST: 23 January 2013 09:25:20 PASSED

This test (967233123071) was completed on the 23 January 2013 09:25:20 and PASSED the requirements for a valid MOT with 1 comments.

This test (967233123071) was completed on the 23 January 2013 09:25:20 and PASSED the requirements for a valid MOT with 1 comments.

Recorded mileage: 95,442

Recorded mileage: 95,442


USER ENTERED


MOT TEST: 26 January 2012 15:38:40 PASSED
MOT TEST: 26 January 2012 15:38:40 PASSED

This test (567866122018) was completed on the 26 January 2012 15:38:40 and PASSED the requirements for a valid MOT with 1 comments.

This test (567866122018) was completed on the 26 January 2012 15:38:40 and PASSED the requirements for a valid MOT with 1 comments.

Recorded mileage: 95,220

Recorded mileage: 95,220


ADVISORY


MOT TEST: 26 January 2012 15:38:40 FAILED
MOT TEST: 26 January 2012 15:38:40 FAILED

This test (315776122013) was completed on the 26 January 2012 15:38:40 and FAILED the requirements for a valid MOT with 3 comments.

This test (315776122013) was completed on the 26 January 2012 15:38:40 and FAILED the requirements for a valid MOT with 3 comments.

Recorded mileage: 95,220

Recorded mileage: 95,220


ADVISORY

PASS WITH RECTIFICATION


MOT TEST: 24 January 2011 15:20:48 PASSED
MOT TEST: 24 January 2011 15:20:48 PASSED

This test (876804821077) was completed on the 24 January 2011 15:20:48 and PASSED the requirements for a valid MOT with 0 comments.

This test (876804821077) was completed on the 24 January 2011 15:20:48 and PASSED the requirements for a valid MOT with 0 comments.

Recorded mileage: 94,804

Recorded mileage: 94,804


MOT TEST: 02 February 2010 15:30:53 PASSED
MOT TEST: 02 February 2010 15:30:53 PASSED

This test (661823630065) was completed on the 02 February 2010 15:30:53 and PASSED the requirements for a valid MOT with 2 comments.

This test (661823630065) was completed on the 02 February 2010 15:30:53 and PASSED the requirements for a valid MOT with 2 comments.

Recorded mileage: 94,347

Recorded mileage: 94,347


ADVISORY


MOT TEST: 13 May 2008 09:29:10 PASSED
MOT TEST: 13 May 2008 09:29:10 PASSED

This test (271194038425) was completed on the 13 May 2008 09:29:10 and PASSED the requirements for a valid MOT with 0 comments.

This test (271194038425) was completed on the 13 May 2008 09:29:10 and PASSED the requirements for a valid MOT with 0 comments.

Recorded mileage: 94,334

Recorded mileage: 94,334


MOT TEST: 02 May 2007 17:07:15 PASSED
MOT TEST: 02 May 2007 17:07:15 PASSED

This test (682912027177) was completed on the 02 May 2007 17:07:15 and PASSED the requirements for a valid MOT with 0 comments.

This test (682912027177) was completed on the 02 May 2007 17:07:15 and PASSED the requirements for a valid MOT with 0 comments.

Recorded mileage: 94,268

Recorded mileage: 94,268


MOT TEST: 30 April 2007 09:13:20 FAILED
MOT TEST: 30 April 2007 09:13:20 FAILED

This test (473300927119) was completed on the 30 April 2007 09:13:20 and FAILED the requirements for a valid MOT with 3 comments.

This test (473300927119) was completed on the 30 April 2007 09:13:20 and FAILED the requirements for a valid MOT with 3 comments.

Recorded mileage: 94,268

Recorded mileage: 94,268


FAIL


MOT TEST: 03 May 2006 12:59:13 PASSED
MOT TEST: 03 May 2006 12:59:13 PASSED

This test (701153426131) was completed on the 03 May 2006 12:59:13 and PASSED the requirements for a valid MOT with 0 comments.

This test (701153426131) was completed on the 03 May 2006 12:59:13 and PASSED the requirements for a valid MOT with 0 comments.

Recorded mileage: 94,171

Recorded mileage: 94,171


MOT TEST: 03 May 2006 10:19:14 FAILED
MOT TEST: 03 May 2006 10:19:14 FAILED

This test (412323326174) was completed on the 03 May 2006 10:19:14 and FAILED the requirements for a valid MOT with 2 comments.

This test (412323326174) was completed on the 03 May 2006 10:19:14 and FAILED the requirements for a valid MOT with 2 comments.

Recorded mileage: 94,171

Recorded mileage: 94,171


FAIL

USER ENTERED