135 1HK


1351HK is registered to a Black 1957, Morris Minor with a Petrol engine. It Failed its most recent MOT Test on the 28 October 2011

14 unique faults (14 Total) reported in its MOT History (4 Tests).

0 common/recurring faults.

75% (3) MOT Pass Rate and a 25% (1) MOT Failure Rate.

29,395 recorded miles.

135 1HK


1351HK is registered to a Black 1957, Morris Minor with a Petrol engine. It Failed its most recent MOT Test on the 28 October 2011

14 unique faults (14 Total) reported in its MOT History (4 Tests).

0 common/recurring faults.

75% (3) MOT Pass Rate and a 25% (1) MOT Failure Rate.

29,395 recorded miles.

MOT PASS/Failure rate for 135 1HK

all MOT test results for 135 1HK represented as a percentage
MOT PASS/Failure rate for 135 1HK
all MOT test results for 135 1HK represented as a percentage

PERCENTAGE OF VEHICLE FAULTS WITH 135 1HK

ALL REPORTED FAULTS, DISPLAYED BY PERCENTAGE OF OCCURRENCE DURING ALL MOT TESTS
PERCENTAGE OF VEHICLE FAULTS WITH 135 1HK
ALL REPORTED FAULTS, DISPLAYED BY PERCENTAGE OF OCCURRENCE DURING ALL MOT TESTS
ADVISORY

FAIL

USER ENTERED

135 1HK annual Faults by type

ALL REPORTED FAULTS, DISPLAYED over time and categorised by type
135 1HK annual Faults by type
ALL REPORTED FAULTS, DISPLAYED over time and categorised by type

ALL 135 1HK ADVISORIES [1]

ALL ADVISORIES, ORDERED by OCCURRENCE DURING 135 1HK's MOT HISTORY
ALL 135 1HK ADVISORIES [1]
ALL ADVISORIES, ORDERED by OCCURRENCE DURING 135 1HK's MOT HISTORY
Advisory Faults | source www.vehiclestats.co.uk
Fault Fault Test Date Test Date/Time Reference MOT Test Reference
1 Service brake: service brake efficiency only just met. It would appear that the braking system requires adjustment or repair. (3.7.b.7) Service brake: service brake efficiency only just met. It would appear that the braking system requires adjustment or repair. (3.7.b.7) 18 September 2008 [15:11] 18/09/2008 194262268251 194262268251

ALL 135 1HK Failure Faults [5]

ALL Failure faults, ORDERED by OCCURRENCE DURING 135 1HK's MOT HISTORY
ALL 135 1HK Failure Faults [5]
ALL Failure faults, ORDERED by OCCURRENCE DURING 135 1HK's MOT HISTORY
Fail Faults | source www.vehiclestats.co.uk
Fault Fault Test Date Test Date/Time Reference MOT Test Reference
1 Nearside windscreen washer provides insufficient washer liquid (8.2.3) Nearside windscreen washer provides insufficient washer liquid (8.2.3) 03 September 2007 [09:38] 03/09/2007 514126647219 514126647219
1 Offside windscreen wiper does not clear the windscreen effectively (8.2.2) Offside windscreen wiper does not clear the windscreen effectively (8.2.2) 03 September 2007 [09:38] 03/09/2007 514126647219 514126647219
1 Registration plate lamp not working (1.1.5c) Registration plate lamp not working (1.1.5c) 03 September 2007 [09:38] 03/09/2007 514126647219 514126647219
1 Windscreen has a sticker or other obstruction encroaching into the swept area by more than 40mm outside zone 'a' (8.3.1e) Windscreen has a sticker or other obstruction encroaching into the swept area by more than 40mm outside zone 'a' (8.3.1e) 03 September 2007 [09:38] 03/09/2007 514126647219 514126647219
1 Nearside headlamp aim too low (1.8) Nearside headlamp aim too low (1.8) 03 September 2007 [09:38] 03/09/2007 514126647219 514126647219

ALL 135 1HK User Entered Faults [8]

ALL User Entered faults, ORDERED by OCCURRENCE DURING 135 1HK's MOT HISTORY
ALL 135 1HK User Entered Faults [8]
ALL User Entered faults, ORDERED by OCCURRENCE DURING 135 1HK's MOT HISTORY
Advisory Faults | source www.vehiclestats.co.uk
Fault Fault Test Date Test Date/Time Reference MOT Test Reference
1 Oil leak Oil leak 18 September 2008 [15:11] 18/09/2008 194262268251 194262268251
1 Rear differentil leaking oil Rear differentil leaking oil 18 September 2008 [15:11] 18/09/2008 194262268251 194262268251
1 Nsr service brake performance poor Nsr service brake performance poor 18 September 2008 [15:11] 18/09/2008 194262268251 194262268251
1 Handbrake requires adjustment Handbrake requires adjustment 03 September 2007 [09:38] 03/09/2007 514126647219 514126647219
1 N/s semaphore arms extends slower than expected N/s semaphore arms extends slower than expected 03 September 2007 [09:38] 03/09/2007 514126647219 514126647219
1 No fog lamp fitted - pre 1980 vehicle No fog lamp fitted - pre 1980 vehicle 03 September 2007 [09:38] 03/09/2007 514126647219 514126647219
1 No seat belts fitted - pre 1965 vehicle No seat belts fitted - pre 1965 vehicle 03 September 2007 [09:38] 03/09/2007 514126647219 514126647219
1 Interior mirror only fitted, no requirement for exterior mirrors - pre 1978 vehicle Interior mirror only fitted, no requirement for exterior mirrors - pre 1978 vehicle 03 September 2007 [09:38] 03/09/2007 514126647219 514126647219

MOT TEST: 28 October 2011 15:52:50 PASSED
MOT TEST: 28 October 2011 15:52:50 PASSED

This test (987951801385) was completed on the 28 October 2011 15:52:50 and PASSED the requirements for a valid MOT with 0 comments.

This test (987951801385) was completed on the 28 October 2011 15:52:50 and PASSED the requirements for a valid MOT with 0 comments.

Recorded mileage: 29,395

Recorded mileage: 29,395


MOT TEST: 18 September 2008 15:11:29 PASSED
MOT TEST: 18 September 2008 15:11:29 PASSED

This test (194262268251) was completed on the 18 September 2008 15:11:29 and PASSED the requirements for a valid MOT with 4 comments.

This test (194262268251) was completed on the 18 September 2008 15:11:29 and PASSED the requirements for a valid MOT with 4 comments.

Recorded mileage: 29,144

Recorded mileage: 29,144


ADVISORY

USER ENTERED


MOT TEST: 04 September 2007 09:40:41 PASSED
MOT TEST: 04 September 2007 09:40:41 PASSED

This test (740877847259) was completed on the 04 September 2007 09:40:41 and PASSED the requirements for a valid MOT with 0 comments.

This test (740877847259) was completed on the 04 September 2007 09:40:41 and PASSED the requirements for a valid MOT with 0 comments.

Recorded mileage: 29,033

Recorded mileage: 29,033


MOT TEST: 03 September 2007 09:38:55 FAILED
MOT TEST: 03 September 2007 09:38:55 FAILED

This test (514126647219) was completed on the 03 September 2007 09:38:55 and FAILED the requirements for a valid MOT with 10 comments.

This test (514126647219) was completed on the 03 September 2007 09:38:55 and FAILED the requirements for a valid MOT with 10 comments.

Recorded mileage: 28,996

Recorded mileage: 28,996


FAIL

USER ENTERED