151 6MU


1516MU is registered to a Green 1962, Morris Mini cooper with a Petrol engine. It Failed its most recent MOT Test on the 13 February 2018

8 unique faults (10 Total) reported in its MOT History (4 Tests).

2 common/recurring faults, the most frequent (2 times) is: Exhaust has a minor leak of exhaust gases (7.1.2).

75% (3) MOT Pass Rate and a 25% (1) MOT Failure Rate.

53,908 recorded miles.

151 6MU


1516MU is registered to a Green 1962, Morris Mini cooper with a Petrol engine. It Failed its most recent MOT Test on the 13 February 2018

8 unique faults (10 Total) reported in its MOT History (4 Tests).

2 common/recurring faults, the most frequent (2 times) is: Exhaust has a minor leak of exhaust gases (7.1.2).

75% (3) MOT Pass Rate and a 25% (1) MOT Failure Rate.

53,908 recorded miles.

MOT PASS/Failure rate for 151 6MU

all MOT test results for 151 6MU represented as a percentage
MOT PASS/Failure rate for 151 6MU
all MOT test results for 151 6MU represented as a percentage

PERCENTAGE OF VEHICLE FAULTS WITH 151 6MU

ALL REPORTED FAULTS, DISPLAYED BY PERCENTAGE OF OCCURRENCE DURING ALL MOT TESTS
PERCENTAGE OF VEHICLE FAULTS WITH 151 6MU
ALL REPORTED FAULTS, DISPLAYED BY PERCENTAGE OF OCCURRENCE DURING ALL MOT TESTS
ADVISORY

FAIL

151 6MU annual Faults by type

ALL REPORTED FAULTS, DISPLAYED over time and categorised by type
151 6MU annual Faults by type
ALL REPORTED FAULTS, DISPLAYED over time and categorised by type

RECURRING FAULTS WITH 151 6MU

FAULTS THAT HAVE OCCURED MORE THAN ONCE DURING 151 6MU's MOT HISTORY
RECURRING FAULTS WITH 151 6MU
FAULTS THAT HAVE OCCURED MORE THAN ONCE DURING 151 6MU's MOT HISTORY
Fault Fault Test Date Test Date/Time Reference MOT Test Reference
2 Exhaust has a minor leak of exhaust gases (7.1.2) Exhaust has a minor leak of exhaust gases (7.1.2) 23 October 2013 [16:59] 23/10/2013 17 October 2013 [11:02] 17/10/2013 367916293455 367916293455 495780593273 495780593273
2 Nearside radius arm has slight play in a pin/bush (2.4.g.2) Nearside radius arm has slight play in a pin/bush (2.4.g.2) 23 October 2013 [16:59] 23/10/2013 17 October 2013 [11:02] 17/10/2013 367916293455 367916293455 495780593273 495780593273

ALL 151 6MU ADVISORIES [4]

ALL ADVISORIES, ORDERED by OCCURRENCE DURING 151 6MU's MOT HISTORY
ALL 151 6MU ADVISORIES [4]
ALL ADVISORIES, ORDERED by OCCURRENCE DURING 151 6MU's MOT HISTORY
Advisory Faults | source www.vehiclestats.co.uk
Fault Fault Test Date Test Date/Time Reference MOT Test Reference
2 Exhaust has a minor leak of exhaust gases (7.1.2) Exhaust has a minor leak of exhaust gases (7.1.2) 23 October 2013 [16:59] 23/10/2013 17 October 2013 [11:02] 17/10/2013 367916293455 367916293455 495780593273 495780593273
2 Nearside radius arm has slight play in a pin/bush (2.4.g.2) Nearside radius arm has slight play in a pin/bush (2.4.g.2) 23 October 2013 [16:59] 23/10/2013 17 October 2013 [11:02] 17/10/2013 367916293455 367916293455 495780593273 495780593273

ALL 151 6MU Failure Faults [6]

ALL Failure faults, ORDERED by OCCURRENCE DURING 151 6MU's MOT HISTORY
ALL 151 6MU Failure Faults [6]
ALL Failure faults, ORDERED by OCCURRENCE DURING 151 6MU's MOT HISTORY
Fail Faults | source www.vehiclestats.co.uk
Fault Fault Test Date Test Date/Time Reference MOT Test Reference
1 Direction indicators not working (1.4.a.2c) Direction indicators not working (1.4.a.2c) 17 October 2013 [11:02] 17/10/2013 495780593273 495780593273
1 Indicator tell tale inoperative (1.4.a.2a) Indicator tell tale inoperative (1.4.a.2a) 17 October 2013 [11:02] 17/10/2013 495780593273 495780593273
1 Offside headlamp aim too high (1.8) Offside headlamp aim too high (1.8) 17 October 2013 [11:02] 17/10/2013 495780593273 495780593273
1 Nearside front wheel bearing has excessive play (2.5.a.3c) Nearside front wheel bearing has excessive play (2.5.a.3c) 17 October 2013 [11:02] 17/10/2013 495780593273 495780593273
1 Nearside front suspension has a suspension upper ball joint securing nut not locked (2.5.b.1a) Nearside front suspension has a suspension upper ball joint securing nut not locked (2.5.b.1a) 17 October 2013 [11:02] 17/10/2013 495780593273 495780593273
1 Front suspension has inadequate clearance with the bump stop (2.4.a.1a) Front suspension has inadequate clearance with the bump stop (2.4.a.1a) 17 October 2013 [11:02] 17/10/2013 495780593273 495780593273

MOT TEST: 13 February 2018 17:02:14 PASSED
MOT TEST: 13 February 2018 17:02:14 PASSED

This test (161999004317) was completed on the 13 February 2018 17:02:14 and PASSED the requirements for a valid MOT with 0 comments.

This test (161999004317) was completed on the 13 February 2018 17:02:14 and PASSED the requirements for a valid MOT with 0 comments.

Recorded mileage: 10,000

Recorded mileage: 10,000


MOT TEST: 07 August 2015 11:28:38 PASSED
MOT TEST: 07 August 2015 11:28:38 PASSED

This test (885279215218) was completed on the 07 August 2015 11:28:38 and PASSED the requirements for a valid MOT with 0 comments.

This test (885279215218) was completed on the 07 August 2015 11:28:38 and PASSED the requirements for a valid MOT with 0 comments.

Recorded mileage: 53,908

Recorded mileage: 53,908


MOT TEST: 23 October 2013 16:59:14 PASSED
MOT TEST: 23 October 2013 16:59:14 PASSED

This test (367916293455) was completed on the 23 October 2013 16:59:14 and PASSED the requirements for a valid MOT with 2 comments.

This test (367916293455) was completed on the 23 October 2013 16:59:14 and PASSED the requirements for a valid MOT with 2 comments.

Recorded mileage: 53,731

Recorded mileage: 53,731


ADVISORY


MOT TEST: 17 October 2013 11:02:34 FAILED
MOT TEST: 17 October 2013 11:02:34 FAILED

This test (495780593273) was completed on the 17 October 2013 11:02:34 and FAILED the requirements for a valid MOT with 8 comments.

This test (495780593273) was completed on the 17 October 2013 11:02:34 and FAILED the requirements for a valid MOT with 8 comments.

Recorded mileage: 53,725

Recorded mileage: 53,725


ADVISORY

FAIL