156 KMJ


156KMJ is registered to a Blue 1963, Morris Minor with a Petrol engine. It Failed its most recent MOT Test on the 16 May 2017

17 unique faults (19 Total) reported in its MOT History (13 Tests).

2 common/recurring faults, the most frequent (2 times) is: Parking brake: efficiency below requirements (3.7.B.7).

69% (9) MOT Pass Rate and a 31% (4) MOT Failure Rate.

2,171 recorded miles.

156 KMJ


156KMJ is registered to a Blue 1963, Morris Minor with a Petrol engine. It Failed its most recent MOT Test on the 16 May 2017

17 unique faults (19 Total) reported in its MOT History (13 Tests).

2 common/recurring faults, the most frequent (2 times) is: Parking brake: efficiency below requirements (3.7.B.7).

69% (9) MOT Pass Rate and a 31% (4) MOT Failure Rate.

2,171 recorded miles.

MOT PASS/Failure rate for 156 KMJ

all MOT test results for 156 KMJ represented as a percentage
MOT PASS/Failure rate for 156 KMJ
all MOT test results for 156 KMJ represented as a percentage

PERCENTAGE OF VEHICLE FAULTS WITH 156 KMJ

ALL REPORTED FAULTS, DISPLAYED BY PERCENTAGE OF OCCURRENCE DURING ALL MOT TESTS
PERCENTAGE OF VEHICLE FAULTS WITH 156 KMJ
ALL REPORTED FAULTS, DISPLAYED BY PERCENTAGE OF OCCURRENCE DURING ALL MOT TESTS
FAIL

PASS WITH RECTIFICATION

156 KMJ annual Faults by type

ALL REPORTED FAULTS, DISPLAYED over time and categorised by type
156 KMJ annual Faults by type
ALL REPORTED FAULTS, DISPLAYED over time and categorised by type

RECURRING FAULTS WITH 156 KMJ

FAULTS THAT HAVE OCCURED MORE THAN ONCE DURING 156 KMJ's MOT HISTORY
RECURRING FAULTS WITH 156 KMJ
FAULTS THAT HAVE OCCURED MORE THAN ONCE DURING 156 KMJ's MOT HISTORY
Fault Fault Test Date Test Date/Time Reference MOT Test Reference
2 Parking brake: efficiency below requirements (3.7.b.7) Parking brake: efficiency below requirements (3.7.b.7) 15 May 2017 [08:47] 15/05/2017 11 May 2006 [15:31] 11/05/2006 312050066630 312050066630 402961036191 402961036191
2 Nearside stop lamp not working (1.2.1b) Nearside stop lamp not working (1.2.1b) 12 October 2013 [12:45] 12/10/2013 11 May 2006 [15:31] 11/05/2006 677365183257 677365183257 402961036191 402961036191

ALL 156 KMJ Failure Faults [18]

ALL Failure faults, ORDERED by OCCURRENCE DURING 156 KMJ's MOT HISTORY
ALL 156 KMJ Failure Faults [18]
ALL Failure faults, ORDERED by OCCURRENCE DURING 156 KMJ's MOT HISTORY
Fail Faults | source www.vehiclestats.co.uk
Fault Fault Test Date Test Date/Time Reference MOT Test Reference
2 Parking brake: efficiency below requirements (3.7.b.7) Parking brake: efficiency below requirements (3.7.b.7) 15 May 2017 [08:47] 15/05/2017 11 May 2006 [15:31] 11/05/2006 312050066630 312050066630 402961036191 402961036191
2 Nearside stop lamp not working (1.2.1b) Nearside stop lamp not working (1.2.1b) 12 October 2013 [12:45] 12/10/2013 11 May 2006 [15:31] 11/05/2006 677365183257 677365183257 402961036191 402961036191
1 Offside rear brake binding (3.7.b.1) Offside rear brake binding (3.7.b.1) 15 May 2017 [08:47] 15/05/2017 312050066630 312050066630
1 Nearside rear brake binding (3.7.b.1) Nearside rear brake binding (3.7.b.1) 15 May 2017 [08:47] 15/05/2017 312050066630 312050066630
1 Nearside rear brake recording little or no effort (3.7.b.5a) Nearside rear brake recording little or no effort (3.7.b.5a) 15 May 2017 [08:47] 15/05/2017 312050066630 312050066630
1 Nearside rear parking brake recording little or no effort (3.7.b.6a) Nearside rear parking brake recording little or no effort (3.7.b.6a) 15 May 2017 [08:47] 15/05/2017 312050066630 312050066630
1 Offside rear parking brake recording little or no effort (3.7.b.6a) Offside rear parking brake recording little or no effort (3.7.b.6a) 15 May 2017 [08:47] 15/05/2017 312050066630 312050066630
1 Nearside front brake binding (3.7.b.1) Nearside front brake binding (3.7.b.1) 15 May 2017 [08:47] 15/05/2017 312050066630 312050066630
1 Brake pedal anti-slip provision missing (3.3.a.1b) Brake pedal anti-slip provision missing (3.3.a.1b) 15 May 2017 [08:47] 15/05/2017 312050066630 312050066630
1 Rear brakes imbalanced across an axle axle 2 (3.7.b.5b) Rear brakes imbalanced across an axle axle 2 (3.7.b.5b) 15 May 2017 [08:47] 15/05/2017 312050066630 312050066630
1 Rear direction indicator not working (1.4.a.2c) Rear direction indicator not working (1.4.a.2c) 12 October 2013 [12:45] 12/10/2013 677365183257 677365183257
1 Registration plate lamp not working (1.1.c.1d) Registration plate lamp not working (1.1.c.1d) 12 October 2013 [12:45] 12/10/2013 677365183257 677365183257
1 Parking brake: efficiency below requirements (3.7.d.4) Parking brake: efficiency below requirements (3.7.d.4) 12 October 2013 [12:45] 12/10/2013 677365183257 677365183257
1 Rear parking (secondary) brakes imbalanced (3.7.b.6b) Rear parking (secondary) brakes imbalanced (3.7.b.6b) 12 October 2013 [12:45] 12/10/2013 677365183257 677365183257
1 Nearside direction indicators not working (1.4.a.2c) Nearside direction indicators not working (1.4.a.2c) 11 May 2006 [15:31] 11/05/2006 402961036191 402961036191
1 Offside rear braking system leaking (3.6.a.1) Offside rear braking system leaking (3.6.a.1) 11 May 2006 [15:31] 11/05/2006 402961036191 402961036191

ALL 156 KMJ Pass With Rectification Faults [1]

ALL Pass With Rectification faults, ORDERED by OCCURRENCE DURING 156 KMJ's MOT HISTORY
ALL 156 KMJ Pass With Rectification Faults [1]
ALL Pass With Rectification faults, ORDERED by OCCURRENCE DURING 156 KMJ's MOT HISTORY
Pass With Rectification Faults | source www.vehiclestats.co.uk
Fault Fault Test Date Test Date/Time Reference MOT Test Reference
1 Offside rear position lamp(s) excessively deteriorated so that it is not visible from a reasonable distance (1.1.a.3d) Offside rear position lamp(s) excessively deteriorated so that it is not visible from a reasonable distance (1.1.a.3d) 24 August 2009 [16:38] 24/08/2009 161356739267 161356739267

MOT TEST: 16 May 2017 11:58:10 PASSED
MOT TEST: 16 May 2017 11:58:10 PASSED

This test (293795132227) was completed on the 16 May 2017 11:58:10 and PASSED the requirements for a valid MOT with 0 comments.

This test (293795132227) was completed on the 16 May 2017 11:58:10 and PASSED the requirements for a valid MOT with 0 comments.

Recorded mileage: 2,171

Recorded mileage: 2,171


MOT TEST: 15 May 2017 08:47:03 FAILED
MOT TEST: 15 May 2017 08:47:03 FAILED

This test (312050066630) was completed on the 15 May 2017 08:47:03 and FAILED the requirements for a valid MOT with 9 comments.

This test (312050066630) was completed on the 15 May 2017 08:47:03 and FAILED the requirements for a valid MOT with 9 comments.

Recorded mileage: 2,171

Recorded mileage: 2,171


FAIL


MOT TEST: 09 May 2015 09:11:07 PASSED
MOT TEST: 09 May 2015 09:11:07 PASSED

This test (817879525105) was completed on the 09 May 2015 09:11:07 and PASSED the requirements for a valid MOT with 0 comments.

This test (817879525105) was completed on the 09 May 2015 09:11:07 and PASSED the requirements for a valid MOT with 0 comments.

Recorded mileage: 2,034

Recorded mileage: 2,034


MOT TEST: 14 October 2013 09:26:08 PASSED
MOT TEST: 14 October 2013 09:26:08 PASSED

This test (359127383249) was completed on the 14 October 2013 09:26:08 and PASSED the requirements for a valid MOT with 0 comments.

This test (359127383249) was completed on the 14 October 2013 09:26:08 and PASSED the requirements for a valid MOT with 0 comments.

Recorded mileage: 1,922

Recorded mileage: 1,922


MOT TEST: 12 October 2013 12:45:13 FAILED
MOT TEST: 12 October 2013 12:45:13 FAILED

This test (677365183257) was completed on the 12 October 2013 12:45:13 and FAILED the requirements for a valid MOT with 5 comments.

This test (677365183257) was completed on the 12 October 2013 12:45:13 and FAILED the requirements for a valid MOT with 5 comments.

Recorded mileage: 1,922

Recorded mileage: 1,922


FAIL


MOT TEST: 24 September 2012 16:57:19 PASSED
MOT TEST: 24 September 2012 16:57:19 PASSED

This test (717398462210) was completed on the 24 September 2012 16:57:19 and PASSED the requirements for a valid MOT with 0 comments.

This test (717398462210) was completed on the 24 September 2012 16:57:19 and PASSED the requirements for a valid MOT with 0 comments.

Recorded mileage: 1,884

Recorded mileage: 1,884


MOT TEST: 26 September 2011 14:00:47 PASSED
MOT TEST: 26 September 2011 14:00:47 PASSED

This test (906019761203) was completed on the 26 September 2011 14:00:47 and PASSED the requirements for a valid MOT with 0 comments.

This test (906019761203) was completed on the 26 September 2011 14:00:47 and PASSED the requirements for a valid MOT with 0 comments.

Recorded mileage: 1,667

Recorded mileage: 1,667


MOT TEST: 27 September 2010 15:00:05 PASSED
MOT TEST: 27 September 2010 15:00:05 PASSED

This test (941780770216) was completed on the 27 September 2010 15:00:05 and PASSED the requirements for a valid MOT with 0 comments.

This test (941780770216) was completed on the 27 September 2010 15:00:05 and PASSED the requirements for a valid MOT with 0 comments.

Recorded mileage: 1,547

Recorded mileage: 1,547


MOT TEST: 24 August 2009 16:38:23 PASSED
MOT TEST: 24 August 2009 16:38:23 PASSED

This test (264206539203) was completed on the 24 August 2009 16:38:23 and PASSED the requirements for a valid MOT with 0 comments.

This test (264206539203) was completed on the 24 August 2009 16:38:23 and PASSED the requirements for a valid MOT with 0 comments.

Recorded mileage: 524

Recorded mileage: 524


MOT TEST: 24 August 2009 16:38:23 FAILED
MOT TEST: 24 August 2009 16:38:23 FAILED

This test (161356739267) was completed on the 24 August 2009 16:38:23 and FAILED the requirements for a valid MOT with 1 comments.

This test (161356739267) was completed on the 24 August 2009 16:38:23 and FAILED the requirements for a valid MOT with 1 comments.

Recorded mileage: 524

Recorded mileage: 524


PASS WITH RECTIFICATION


MOT TEST: 03 August 2007 15:07:54 PASSED
MOT TEST: 03 August 2007 15:07:54 PASSED

This test (201505617298) was completed on the 03 August 2007 15:07:54 and PASSED the requirements for a valid MOT with 0 comments.

This test (201505617298) was completed on the 03 August 2007 15:07:54 and PASSED the requirements for a valid MOT with 0 comments.

Recorded mileage: 263

Recorded mileage: 263


MOT TEST: 18 May 2006 08:44:38 PASSED
MOT TEST: 18 May 2006 08:44:38 PASSED

This test (553118136126) was completed on the 18 May 2006 08:44:38 and PASSED the requirements for a valid MOT with 0 comments.

This test (553118136126) was completed on the 18 May 2006 08:44:38 and PASSED the requirements for a valid MOT with 0 comments.

Recorded mileage: 247

Recorded mileage: 247


MOT TEST: 11 May 2006 15:31:08 FAILED
MOT TEST: 11 May 2006 15:31:08 FAILED

This test (402961036191) was completed on the 11 May 2006 15:31:08 and FAILED the requirements for a valid MOT with 4 comments.

This test (402961036191) was completed on the 11 May 2006 15:31:08 and FAILED the requirements for a valid MOT with 4 comments.

Recorded mileage: 234

Recorded mileage: 234


FAIL