162 3LJ


1623LJ is registered to a Green 1961, Morris 1000 with a Petrol engine. It Passed its most recent MOT Test on the 25 June 2018

15 unique faults (18 Total) reported in its MOT History (18 Tests).

3 common/recurring faults, the most frequent (2 times) is: Nearside Rear Brakes imbalanced requirements only just met. It would appear that the braking system requires adjustment or repair. (3.7.B.5b).

67% (12) MOT Pass Rate and a 33% (6) MOT Failure Rate.

81,516 recorded miles.

162 3LJ


1623LJ is registered to a Green 1961, Morris 1000 with a Petrol engine. It Passed its most recent MOT Test on the 25 June 2018

15 unique faults (18 Total) reported in its MOT History (18 Tests).

3 common/recurring faults, the most frequent (2 times) is: Nearside Rear Brakes imbalanced requirements only just met. It would appear that the braking system requires adjustment or repair. (3.7.B.5b).

67% (12) MOT Pass Rate and a 33% (6) MOT Failure Rate.

81,516 recorded miles.

MOT PASS/Failure rate for 162 3LJ

all MOT test results for 162 3LJ represented as a percentage
MOT PASS/Failure rate for 162 3LJ
all MOT test results for 162 3LJ represented as a percentage

PERCENTAGE OF VEHICLE FAULTS WITH 162 3LJ

ALL REPORTED FAULTS, DISPLAYED BY PERCENTAGE OF OCCURRENCE DURING ALL MOT TESTS
PERCENTAGE OF VEHICLE FAULTS WITH 162 3LJ
ALL REPORTED FAULTS, DISPLAYED BY PERCENTAGE OF OCCURRENCE DURING ALL MOT TESTS
ADVISORY

FAIL

PASS WITH RECTIFICATION

162 3LJ annual Faults by type

ALL REPORTED FAULTS, DISPLAYED over time and categorised by type
162 3LJ annual Faults by type
ALL REPORTED FAULTS, DISPLAYED over time and categorised by type

RECURRING FAULTS WITH 162 3LJ

FAULTS THAT HAVE OCCURED MORE THAN ONCE DURING 162 3LJ's MOT HISTORY
RECURRING FAULTS WITH 162 3LJ
FAULTS THAT HAVE OCCURED MORE THAN ONCE DURING 162 3LJ's MOT HISTORY
Fault Fault Test Date Test Date/Time Reference MOT Test Reference
2 Nearside rear brakes imbalanced requirements only just met. It would appear that the braking system requires adjustment or repair. (3.7.b.5b) Nearside rear brakes imbalanced requirements only just met. It would appear that the braking system requires adjustment or repair. (3.7.b.5b) 26 June 2014 [13:05] 26/06/2014 26 June 2014 [13:05] 26/06/2014 207987274415 207987274415 209087374482 209087374482
2 Nearside rear service brake: service brake efficiency only just met. It would appear that the braking system requires adjustment or repair. (3.7.b.7) Nearside rear service brake: service brake efficiency only just met. It would appear that the braking system requires adjustment or repair. (3.7.b.7) 26 June 2014 [13:05] 26/06/2014 26 June 2014 [13:05] 26/06/2014 207987274415 207987274415 209087374482 209087374482
2 Nearside track rod end ball joint has slight play (2.2.b.1f) Nearside track rod end ball joint has slight play (2.2.b.1f) 20 July 2007 [16:25] 20/07/2007 20 July 2007 [16:25] 20/07/2007 583891107217 583891107217 221841607232 221841607232

ALL 162 3LJ ADVISORIES [7]

ALL ADVISORIES, ORDERED by OCCURRENCE DURING 162 3LJ's MOT HISTORY
ALL 162 3LJ ADVISORIES [7]
ALL ADVISORIES, ORDERED by OCCURRENCE DURING 162 3LJ's MOT HISTORY
Advisory Faults | source www.vehiclestats.co.uk
Fault Fault Test Date Test Date/Time Reference MOT Test Reference
2 Nearside rear brakes imbalanced requirements only just met. It would appear that the braking system requires adjustment or repair. (3.7.b.5b) Nearside rear brakes imbalanced requirements only just met. It would appear that the braking system requires adjustment or repair. (3.7.b.5b) 26 June 2014 [13:05] 26/06/2014 26 June 2014 [13:05] 26/06/2014 207987274415 207987274415 209087374482 209087374482
2 Nearside rear service brake: service brake efficiency only just met. It would appear that the braking system requires adjustment or repair. (3.7.b.7) Nearside rear service brake: service brake efficiency only just met. It would appear that the braking system requires adjustment or repair. (3.7.b.7) 26 June 2014 [13:05] 26/06/2014 26 June 2014 [13:05] 26/06/2014 207987274415 207987274415 209087374482 209087374482
2 Nearside track rod end ball joint has slight play (2.2.b.1f) Nearside track rod end ball joint has slight play (2.2.b.1f) 20 July 2007 [16:25] 20/07/2007 20 July 2007 [16:25] 20/07/2007 583891107217 583891107217 221841607232 221841607232
1 Nearside rear rear parking (secondary) brake imbalance requirements only just met. It would appear that the braking system requires adjustment or repair. (3.7.b.6b) Nearside rear rear parking (secondary) brake imbalance requirements only just met. It would appear that the braking system requires adjustment or repair. (3.7.b.6b) 29 June 2015 [10:08] 29/06/2015 928660185171 928660185171

ALL 162 3LJ Failure Faults [3]

ALL Failure faults, ORDERED by OCCURRENCE DURING 162 3LJ's MOT HISTORY
ALL 162 3LJ Failure Faults [3]
ALL Failure faults, ORDERED by OCCURRENCE DURING 162 3LJ's MOT HISTORY
Fail Faults | source www.vehiclestats.co.uk
Fault Fault Test Date Test Date/Time Reference MOT Test Reference
1 Nearside rear stop lamp not working (1.2.1b) Nearside rear stop lamp not working (1.2.1b) 18 July 2006 [09:30] 18/07/2006 702749596119 702749596119
1 Nearside front shock absorber has a serious fluid leak (2.7.3) Nearside front shock absorber has a serious fluid leak (2.7.3) 18 July 2006 [09:30] 18/07/2006 702749596119 702749596119
1 Offside rear leaf spring splayed and fouling (2.4.b.1c) Offside rear leaf spring splayed and fouling (2.4.b.1c) 18 July 2006 [09:30] 18/07/2006 702749596119 702749596119

ALL 162 3LJ Pass With Rectification Faults [8]

ALL Pass With Rectification faults, ORDERED by OCCURRENCE DURING 162 3LJ's MOT HISTORY
ALL 162 3LJ Pass With Rectification Faults [8]
ALL Pass With Rectification faults, ORDERED by OCCURRENCE DURING 162 3LJ's MOT HISTORY
Pass With Rectification Faults | source www.vehiclestats.co.uk
Fault Fault Test Date Test Date/Time Reference MOT Test Reference
1 Front fuel hose leaking (7.2.3) Front fuel hose leaking (7.2.3) 15 June 2017 [09:42] 15/06/2017 644560172762 644560172762
1 Front windscreen washer provides insufficient washer liquid (8.2.3) Front windscreen washer provides insufficient washer liquid (8.2.3) 26 June 2014 [13:05] 26/06/2014 209087374482 209087374482
1 Rear exhaust system not adequately supported (7.1.1) Rear exhaust system not adequately supported (7.1.1) 27 June 2013 [12:53] 27/06/2013 275838273111 275838273111
1 Nearside rear braking system leaking (3.6.a.1) Nearside rear braking system leaking (3.6.a.1) 27 June 2013 [12:53] 27/06/2013 275838273111 275838273111
1 Offside headlamp not working on dipped beam (1.7.5a) Offside headlamp not working on dipped beam (1.7.5a) 29 August 2008 [14:30] 29/08/2008 810262748222 810262748222
1 Offside headlamp excessively damaged so that the light output is severely reduced (1.7.5a) Offside headlamp excessively damaged so that the light output is severely reduced (1.7.5a) 29 August 2008 [14:30] 29/08/2008 810262748222 810262748222
1 Nearside headlamp aim too high and too far to the right. (1.8) Nearside headlamp aim too high and too far to the right. (1.8) 20 July 2007 [16:25] 20/07/2007 583891107217 583891107217
1 Offside headlamp aim too high and too far to the right. (1.8) Offside headlamp aim too high and too far to the right. (1.8) 20 July 2007 [16:25] 20/07/2007 583891107217 583891107217

MOT TEST: 25 June 2018 14:03:16 PASSED
MOT TEST: 25 June 2018 14:03:16 PASSED

This test (891368795336) was completed on the 25 June 2018 14:03:16 and PASSED the requirements for a valid MOT with 0 comments.

This test (891368795336) was completed on the 25 June 2018 14:03:16 and PASSED the requirements for a valid MOT with 0 comments.

Recorded mileage: 10,253

Recorded mileage: 10,253


MOT TEST: 15 June 2017 09:42:26 PASSED
MOT TEST: 15 June 2017 09:42:26 PASSED

This test (639980035908) was completed on the 15 June 2017 09:42:26 and PASSED the requirements for a valid MOT with 0 comments.

This test (639980035908) was completed on the 15 June 2017 09:42:26 and PASSED the requirements for a valid MOT with 0 comments.

Recorded mileage: 10,186

Recorded mileage: 10,186


MOT TEST: 15 June 2017 09:42:25 FAILED
MOT TEST: 15 June 2017 09:42:25 FAILED

This test (644560172762) was completed on the 15 June 2017 09:42:25 and FAILED the requirements for a valid MOT with 1 comments.

This test (644560172762) was completed on the 15 June 2017 09:42:25 and FAILED the requirements for a valid MOT with 1 comments.

Recorded mileage: 10,186

Recorded mileage: 10,186


PASS WITH RECTIFICATION


MOT TEST: 28 June 2016 10:44:49 PASSED
MOT TEST: 28 June 2016 10:44:49 PASSED

This test (204579439634) was completed on the 28 June 2016 10:44:49 and PASSED the requirements for a valid MOT with 0 comments.

This test (204579439634) was completed on the 28 June 2016 10:44:49 and PASSED the requirements for a valid MOT with 0 comments.

Recorded mileage: 10,052

Recorded mileage: 10,052


MOT TEST: 29 June 2015 10:08:26 PASSED
MOT TEST: 29 June 2015 10:08:26 PASSED

This test (928660185171) was completed on the 29 June 2015 10:08:26 and PASSED the requirements for a valid MOT with 1 comments.

This test (928660185171) was completed on the 29 June 2015 10:08:26 and PASSED the requirements for a valid MOT with 1 comments.

Recorded mileage: 9,414

Recorded mileage: 9,414


ADVISORY


MOT TEST: 26 June 2014 13:05:08 PASSED
MOT TEST: 26 June 2014 13:05:08 PASSED

This test (207987274415) was completed on the 26 June 2014 13:05:08 and PASSED the requirements for a valid MOT with 2 comments.

This test (207987274415) was completed on the 26 June 2014 13:05:08 and PASSED the requirements for a valid MOT with 2 comments.

Recorded mileage: 8,418

Recorded mileage: 8,418


ADVISORY


MOT TEST: 26 June 2014 13:05:08 FAILED
MOT TEST: 26 June 2014 13:05:08 FAILED

This test (209087374482) was completed on the 26 June 2014 13:05:08 and FAILED the requirements for a valid MOT with 3 comments.

This test (209087374482) was completed on the 26 June 2014 13:05:08 and FAILED the requirements for a valid MOT with 3 comments.

Recorded mileage: 8,418

Recorded mileage: 8,418


ADVISORY

PASS WITH RECTIFICATION


MOT TEST: 27 June 2013 12:53:11 PASSED
MOT TEST: 27 June 2013 12:53:11 PASSED

This test (215358273172) was completed on the 27 June 2013 12:53:11 and PASSED the requirements for a valid MOT with 0 comments.

This test (215358273172) was completed on the 27 June 2013 12:53:11 and PASSED the requirements for a valid MOT with 0 comments.

Recorded mileage: 7,183

Recorded mileage: 7,183


MOT TEST: 27 June 2013 12:53:11 FAILED
MOT TEST: 27 June 2013 12:53:11 FAILED

This test (275838273111) was completed on the 27 June 2013 12:53:11 and FAILED the requirements for a valid MOT with 2 comments.

This test (275838273111) was completed on the 27 June 2013 12:53:11 and FAILED the requirements for a valid MOT with 2 comments.

Recorded mileage: 7,183

Recorded mileage: 7,183


PASS WITH RECTIFICATION


MOT TEST: 19 June 2012 12:22:54 PASSED
MOT TEST: 19 June 2012 12:22:54 PASSED

This test (945791972197) was completed on the 19 June 2012 12:22:54 and PASSED the requirements for a valid MOT with 0 comments.

This test (945791972197) was completed on the 19 June 2012 12:22:54 and PASSED the requirements for a valid MOT with 0 comments.

Recorded mileage: 5,643

Recorded mileage: 5,643


MOT TEST: 30 June 2011 16:11:05 PASSED
MOT TEST: 30 June 2011 16:11:05 PASSED

This test (107071181150) was completed on the 30 June 2011 16:11:05 and PASSED the requirements for a valid MOT with 0 comments.

This test (107071181150) was completed on the 30 June 2011 16:11:05 and PASSED the requirements for a valid MOT with 0 comments.

Recorded mileage: 4,445

Recorded mileage: 4,445


MOT TEST: 20 July 2009 15:18:19 PASSED
MOT TEST: 20 July 2009 15:18:19 PASSED

This test (202841109205) was completed on the 20 July 2009 15:18:19 and PASSED the requirements for a valid MOT with 0 comments.

This test (202841109205) was completed on the 20 July 2009 15:18:19 and PASSED the requirements for a valid MOT with 0 comments.

Recorded mileage: 2,608

Recorded mileage: 2,608


MOT TEST: 29 August 2008 14:30:00 PASSED
MOT TEST: 29 August 2008 14:30:00 PASSED

This test (330922948460) was completed on the 29 August 2008 14:30:00 and PASSED the requirements for a valid MOT with 0 comments.

This test (330922948460) was completed on the 29 August 2008 14:30:00 and PASSED the requirements for a valid MOT with 0 comments.

Recorded mileage: 1,478

Recorded mileage: 1,478


MOT TEST: 29 August 2008 14:30:00 FAILED
MOT TEST: 29 August 2008 14:30:00 FAILED

This test (810262748222) was completed on the 29 August 2008 14:30:00 and FAILED the requirements for a valid MOT with 2 comments.

This test (810262748222) was completed on the 29 August 2008 14:30:00 and FAILED the requirements for a valid MOT with 2 comments.

Recorded mileage: 1,478

Recorded mileage: 1,478


PASS WITH RECTIFICATION


MOT TEST: 20 July 2007 16:25:26 FAILED
MOT TEST: 20 July 2007 16:25:26 FAILED

This test (583891107217) was completed on the 20 July 2007 16:25:26 and FAILED the requirements for a valid MOT with 3 comments.

This test (583891107217) was completed on the 20 July 2007 16:25:26 and FAILED the requirements for a valid MOT with 3 comments.

Recorded mileage: 321

Recorded mileage: 321


ADVISORY

PASS WITH RECTIFICATION


MOT TEST: 20 July 2007 16:25:26 PASSED
MOT TEST: 20 July 2007 16:25:26 PASSED

This test (221841607232) was completed on the 20 July 2007 16:25:26 and PASSED the requirements for a valid MOT with 1 comments.

This test (221841607232) was completed on the 20 July 2007 16:25:26 and PASSED the requirements for a valid MOT with 1 comments.

Recorded mileage: 321

Recorded mileage: 321


ADVISORY


MOT TEST: 19 July 2006 17:07:52 PASSED
MOT TEST: 19 July 2006 17:07:52 PASSED

This test (614200106239) was completed on the 19 July 2006 17:07:52 and PASSED the requirements for a valid MOT with 0 comments.

This test (614200106239) was completed on the 19 July 2006 17:07:52 and PASSED the requirements for a valid MOT with 0 comments.

Recorded mileage: 81,516

Recorded mileage: 81,516


MOT TEST: 18 July 2006 09:30:24 FAILED
MOT TEST: 18 July 2006 09:30:24 FAILED

This test (702749596119) was completed on the 18 July 2006 09:30:24 and FAILED the requirements for a valid MOT with 3 comments.

This test (702749596119) was completed on the 18 July 2006 09:30:24 and FAILED the requirements for a valid MOT with 3 comments.

Recorded mileage: 81,516

Recorded mileage: 81,516


FAIL