162 EPX


162EPX is registered to a Green 1962, Morris Minor traveller with a Petrol engine. It Failed its most recent MOT Test on the 02 June 2017

14 unique faults (14 Total) reported in its MOT History (11 Tests).

0 common/recurring faults.

64% (7) MOT Pass Rate and a 36% (4) MOT Failure Rate.

91,543 recorded miles.

162 EPX


162EPX is registered to a Green 1962, Morris Minor traveller with a Petrol engine. It Failed its most recent MOT Test on the 02 June 2017

14 unique faults (14 Total) reported in its MOT History (11 Tests).

0 common/recurring faults.

64% (7) MOT Pass Rate and a 36% (4) MOT Failure Rate.

91,543 recorded miles.

MOT PASS/Failure rate for 162 EPX

all MOT test results for 162 EPX represented as a percentage
MOT PASS/Failure rate for 162 EPX
all MOT test results for 162 EPX represented as a percentage

PERCENTAGE OF VEHICLE FAULTS WITH 162 EPX

ALL REPORTED FAULTS, DISPLAYED BY PERCENTAGE OF OCCURRENCE DURING ALL MOT TESTS
PERCENTAGE OF VEHICLE FAULTS WITH 162 EPX
ALL REPORTED FAULTS, DISPLAYED BY PERCENTAGE OF OCCURRENCE DURING ALL MOT TESTS
FAIL

USER ENTERED

PASS WITH RECTIFICATION

162 EPX annual Faults by type

ALL REPORTED FAULTS, DISPLAYED over time and categorised by type
162 EPX annual Faults by type
ALL REPORTED FAULTS, DISPLAYED over time and categorised by type

ALL 162 EPX Failure Faults [12]

ALL Failure faults, ORDERED by OCCURRENCE DURING 162 EPX's MOT HISTORY
ALL 162 EPX Failure Faults [12]
ALL Failure faults, ORDERED by OCCURRENCE DURING 162 EPX's MOT HISTORY
Fail Faults | source www.vehiclestats.co.uk
Fault Fault Test Date Test Date/Time Reference MOT Test Reference
1 Offside headlamp not working on dipped beam (1.7.5a) Offside headlamp not working on dipped beam (1.7.5a) 01 April 2016 [14:03] 01/04/2016 782106032391 782106032391
1 Offside steering rack gaiter split (2.2.d.2d) Offside steering rack gaiter split (2.2.d.2d) 01 April 2016 [14:03] 01/04/2016 782106032391 782106032391
1 Nearside rear stop lamp not working (1.2.1b) Nearside rear stop lamp not working (1.2.1b) 18 July 2007 [10:37] 18/07/2007 621199997151 621199997151
1 Offside rear stop lamp not working (1.2.1b) Offside rear stop lamp not working (1.2.1b) 18 July 2007 [10:37] 18/07/2007 621199997151 621199997151
1 Nearside rear rear position lamp(s) excessively damaged so that it is not visible from a reasonable distance (1.1.a.3d) Nearside rear rear position lamp(s) excessively damaged so that it is not visible from a reasonable distance (1.1.a.3d) 18 July 2007 [10:37] 18/07/2007 621199997151 621199997151
1 Offside rear suspension spring mounting prescribed area is inadequately repaired (2.4.a.3) Offside rear suspension spring mounting prescribed area is inadequately repaired (2.4.a.3) 18 July 2007 [10:37] 18/07/2007 621199997151 621199997151
1 Offside front torsion bar excessive play at an end fixing (2.4.e.2) Offside front torsion bar excessive play at an end fixing (2.4.e.2) 18 July 2007 [10:37] 18/07/2007 621199997151 621199997151
1 Position lamp switch faulty (1.1.a.1) Position lamp switch faulty (1.1.a.1) 10 April 2007 [11:25] 10/04/2007 144310907117 144310907117
1 Nearside seat belt anchorage prescribed area is excessively corroded (5.2.6) Nearside seat belt anchorage prescribed area is excessively corroded (5.2.6) 10 April 2007 [11:25] 10/04/2007 144310907117 144310907117
1 Offside seat belt anchorage prescribed area is excessively corroded (5.2.6) Offside seat belt anchorage prescribed area is excessively corroded (5.2.6) 10 April 2007 [11:25] 10/04/2007 144310907117 144310907117
1 Nearside front suspension component mounting prescribed area is excessively corroded (2.4.a.3) Nearside front suspension component mounting prescribed area is excessively corroded (2.4.a.3) 10 April 2007 [11:25] 10/04/2007 144310907117 144310907117
1 Offside front suspension component mounting prescribed area is excessively corroded (2.4.a.3) Offside front suspension component mounting prescribed area is excessively corroded (2.4.a.3) 10 April 2007 [11:25] 10/04/2007 144310907117 144310907117

ALL 162 EPX User Entered Faults [1]

ALL User Entered faults, ORDERED by OCCURRENCE DURING 162 EPX's MOT HISTORY
ALL 162 EPX User Entered Faults [1]
ALL User Entered faults, ORDERED by OCCURRENCE DURING 162 EPX's MOT HISTORY
User Entered Faults | source www.vehiclestats.co.uk
Fault Fault Test Date Test Date/Time Reference MOT Test Reference
1 All floor pans and chassis members rusting. †most of the welding is not up to a good standard but i cannot fail m.o.t. All floor pans and chassis members rusting. †most of the welding is not up to a good standard but i cannot fail m.o.t. 16 March 2006 [14:25] 16/03/2006 271485076026 271485076026

ALL 162 EPX Pass With Rectification Faults [1]

ALL Pass With Rectification faults, ORDERED by OCCURRENCE DURING 162 EPX's MOT HISTORY
ALL 162 EPX Pass With Rectification Faults [1]
ALL Pass With Rectification faults, ORDERED by OCCURRENCE DURING 162 EPX's MOT HISTORY
Pass With Rectification Faults | source www.vehiclestats.co.uk
Fault Fault Test Date Test Date/Time Reference MOT Test Reference
1 Offside rear suspension spring mounting prescribed area is excessively corroded (2.4.a.3) Offside rear suspension spring mounting prescribed area is excessively corroded (2.4.a.3) 15 July 2008 [11:15] 15/07/2008 930637098102 930637098102

MOT TEST: 02 June 2017 18:42:50 PASSED
MOT TEST: 02 June 2017 18:42:50 PASSED

This test (538465569711) was completed on the 02 June 2017 18:42:50 and PASSED the requirements for a valid MOT with 0 comments.

This test (538465569711) was completed on the 02 June 2017 18:42:50 and PASSED the requirements for a valid MOT with 0 comments.

Recorded mileage: 91,543

Recorded mileage: 91,543


MOT TEST: 13 April 2016 08:57:46 PASSED
MOT TEST: 13 April 2016 08:57:46 PASSED

This test (948209478638) was completed on the 13 April 2016 08:57:46 and PASSED the requirements for a valid MOT with 0 comments.

This test (948209478638) was completed on the 13 April 2016 08:57:46 and PASSED the requirements for a valid MOT with 0 comments.

Recorded mileage: 90,970

Recorded mileage: 90,970


MOT TEST: 01 April 2016 14:03:11 FAILED
MOT TEST: 01 April 2016 14:03:11 FAILED

This test (782106032391) was completed on the 01 April 2016 14:03:11 and FAILED the requirements for a valid MOT with 2 comments.

This test (782106032391) was completed on the 01 April 2016 14:03:11 and FAILED the requirements for a valid MOT with 2 comments.

Recorded mileage: 90,970

Recorded mileage: 90,970


FAIL


MOT TEST: 31 July 2014 13:56:12 PASSED
MOT TEST: 31 July 2014 13:56:12 PASSED

This test (749472814295) was completed on the 31 July 2014 13:56:12 and PASSED the requirements for a valid MOT with 0 comments.

This test (749472814295) was completed on the 31 July 2014 13:56:12 and PASSED the requirements for a valid MOT with 0 comments.

Recorded mileage: 89,595

Recorded mileage: 89,595


MOT TEST: 25 July 2013 14:45:57 PASSED
MOT TEST: 25 July 2013 14:45:57 PASSED

This test (347796103439) was completed on the 25 July 2013 14:45:57 and PASSED the requirements for a valid MOT with 0 comments.

This test (347796103439) was completed on the 25 July 2013 14:45:57 and PASSED the requirements for a valid MOT with 0 comments.

Recorded mileage: 88,045

Recorded mileage: 88,045


MOT TEST: 15 July 2008 11:15:00 PASSED
MOT TEST: 15 July 2008 11:15:00 PASSED

This test (561467698101) was completed on the 15 July 2008 11:15:00 and PASSED the requirements for a valid MOT with 0 comments.

This test (561467698101) was completed on the 15 July 2008 11:15:00 and PASSED the requirements for a valid MOT with 0 comments.

Recorded mileage: 87,731

Recorded mileage: 87,731


MOT TEST: 15 July 2008 11:15:00 FAILED
MOT TEST: 15 July 2008 11:15:00 FAILED

This test (930637098102) was completed on the 15 July 2008 11:15:00 and FAILED the requirements for a valid MOT with 1 comments.

This test (930637098102) was completed on the 15 July 2008 11:15:00 and FAILED the requirements for a valid MOT with 1 comments.

Recorded mileage: 87,731

Recorded mileage: 87,731


PASS WITH RECTIFICATION


MOT TEST: 20 July 2007 15:01:20 PASSED
MOT TEST: 20 July 2007 15:01:20 PASSED

This test (711641907231) was completed on the 20 July 2007 15:01:20 and PASSED the requirements for a valid MOT with 0 comments.

This test (711641907231) was completed on the 20 July 2007 15:01:20 and PASSED the requirements for a valid MOT with 0 comments.

Recorded mileage: 86,803

Recorded mileage: 86,803


MOT TEST: 18 July 2007 10:37:25 FAILED
MOT TEST: 18 July 2007 10:37:25 FAILED

This test (621199997151) was completed on the 18 July 2007 10:37:25 and FAILED the requirements for a valid MOT with 5 comments.

This test (621199997151) was completed on the 18 July 2007 10:37:25 and FAILED the requirements for a valid MOT with 5 comments.

Recorded mileage: 86,782

Recorded mileage: 86,782


FAIL


MOT TEST: 10 April 2007 11:25:02 FAILED
MOT TEST: 10 April 2007 11:25:02 FAILED

This test (144310907117) was completed on the 10 April 2007 11:25:02 and FAILED the requirements for a valid MOT with 5 comments.

This test (144310907117) was completed on the 10 April 2007 11:25:02 and FAILED the requirements for a valid MOT with 5 comments.

Recorded mileage: 86,664

Recorded mileage: 86,664


FAIL


MOT TEST: 16 March 2006 14:25:10 PASSED
MOT TEST: 16 March 2006 14:25:10 PASSED

This test (271485076026) was completed on the 16 March 2006 14:25:10 and PASSED the requirements for a valid MOT with 1 comments.

This test (271485076026) was completed on the 16 March 2006 14:25:10 and PASSED the requirements for a valid MOT with 1 comments.

Recorded mileage: 84,958

Recorded mileage: 84,958


USER ENTERED