1NLH


1NLH is registered to a Grey 1969, Morris Minor 1000 with a Petrol engine. It Failed its most recent MOT Test on the 01 November 2017

28 unique faults (31 Total) reported in its MOT History (16 Tests).

3 common/recurring faults, the most frequent (2 times) is: Service brake: efficiency below requirements (3.7.B.7).

75% (12) MOT Pass Rate and a 25% (4) MOT Failure Rate.

36,946 recorded miles.

1NLH


1NLH is registered to a Grey 1969, Morris Minor 1000 with a Petrol engine. It Failed its most recent MOT Test on the 01 November 2017

28 unique faults (31 Total) reported in its MOT History (16 Tests).

3 common/recurring faults, the most frequent (2 times) is: Service brake: efficiency below requirements (3.7.B.7).

75% (12) MOT Pass Rate and a 25% (4) MOT Failure Rate.

36,946 recorded miles.

MOT PASS/Failure rate for 1NLH

all MOT test results for 1NLH represented as a percentage
MOT PASS/Failure rate for 1NLH
all MOT test results for 1NLH represented as a percentage

PERCENTAGE OF VEHICLE FAULTS WITH 1NLH

ALL REPORTED FAULTS, DISPLAYED BY PERCENTAGE OF OCCURRENCE DURING ALL MOT TESTS
PERCENTAGE OF VEHICLE FAULTS WITH 1NLH
ALL REPORTED FAULTS, DISPLAYED BY PERCENTAGE OF OCCURRENCE DURING ALL MOT TESTS
FAIL

USER ENTERED

PASS WITH RECTIFICATION

1NLH annual Faults by type

ALL REPORTED FAULTS, DISPLAYED over time and categorised by type
1NLH annual Faults by type
ALL REPORTED FAULTS, DISPLAYED over time and categorised by type

RECURRING FAULTS WITH 1NLH

FAULTS THAT HAVE OCCURED MORE THAN ONCE DURING 1NLH's MOT HISTORY
RECURRING FAULTS WITH 1NLH
FAULTS THAT HAVE OCCURED MORE THAN ONCE DURING 1NLH's MOT HISTORY
Fault Fault Test Date Test Date/Time Reference MOT Test Reference
2 Service brake: efficiency below requirements (3.7.b.7) Service brake: efficiency below requirements (3.7.b.7) 14 October 2013 [11:24] 14/10/2013 26 April 2007 [10:56] 26/04/2007 325557383269 325557383269 421386117100 421386117100
2 Parking brake: efficiency below requirements (3.7.b.7) Parking brake: efficiency below requirements (3.7.b.7) 14 October 2013 [11:24] 14/10/2013 01 June 2006 [14:22] 01/06/2006 325557383269 325557383269 604492856152 604492856152
2 Brakes imbalanced across an axle (3.7.b.5b) Brakes imbalanced across an axle (3.7.b.5b) 14 October 2013 [11:24] 14/10/2013 01 June 2006 [14:22] 01/06/2006 325557383269 325557383269 604492856152 604492856152

ALL 1NLH Failure Faults [27]

ALL Failure faults, ORDERED by OCCURRENCE DURING 1NLH's MOT HISTORY
ALL 1NLH Failure Faults [27]
ALL Failure faults, ORDERED by OCCURRENCE DURING 1NLH's MOT HISTORY
Fail Faults | source www.vehiclestats.co.uk
Fault Fault Test Date Test Date/Time Reference MOT Test Reference
2 Service brake: efficiency below requirements (3.7.b.7) Service brake: efficiency below requirements (3.7.b.7) 14 October 2013 [11:24] 14/10/2013 26 April 2007 [10:56] 26/04/2007 325557383269 325557383269 421386117100 421386117100
2 Parking brake: efficiency below requirements (3.7.b.7) Parking brake: efficiency below requirements (3.7.b.7) 14 October 2013 [11:24] 14/10/2013 01 June 2006 [14:22] 01/06/2006 325557383269 325557383269 604492856152 604492856152
2 Brakes imbalanced across an axle (3.7.b.5b) Brakes imbalanced across an axle (3.7.b.5b) 14 October 2013 [11:24] 14/10/2013 01 June 2006 [14:22] 01/06/2006 325557383269 325557383269 604492856152 604492856152
1 Offside front brake binding (3.7.b.1) Offside front brake binding (3.7.b.1) 14 October 2013 [11:24] 14/10/2013 325557383269 325557383269
1 Brake performance not tested (3.7.a.1) Brake performance not tested (3.7.a.1) 14 October 2013 [11:24] 14/10/2013 325557383269 325557383269
1 Registration plate lamp not working (1.1.c.1d) Registration plate lamp not working (1.1.c.1d) 14 October 2013 [11:24] 14/10/2013 325557383269 325557383269
1 Offside front position lamp(s) not working (1.1.a.3b) Offside front position lamp(s) not working (1.1.a.3b) 26 April 2007 [10:56] 26/04/2007 421386117100 421386117100
1 Offside headlamp not working on main beam (1.7.5a) Offside headlamp not working on main beam (1.7.5a) 26 April 2007 [10:56] 26/04/2007 421386117100 421386117100
1 Offside headlamp not in good working order adversely affecting beam image (1.2.4a) Offside headlamp not in good working order adversely affecting beam image (1.2.4a) 26 April 2007 [10:56] 26/04/2007 421386117100 421386117100
1 Offside front wheel bearing rough when rotated (2.5.a.2) Offside front wheel bearing rough when rotated (2.5.a.2) 26 April 2007 [10:56] 26/04/2007 421386117100 421386117100
1 Nearside rear shock absorber has a serious fluid leak (2.7.3) Nearside rear shock absorber has a serious fluid leak (2.7.3) 26 April 2007 [10:56] 26/04/2007 421386117100 421386117100
1 Nearside rear leaf spring linkage pin excessively loose in its bracket (2.4.b.3a) Nearside rear leaf spring linkage pin excessively loose in its bracket (2.4.b.3a) 26 April 2007 [10:56] 26/04/2007 421386117100 421386117100
1 Offside vehicle structure has excessive corrosion which adversely affects braking or steering (6.1.a.1) Offside vehicle structure has excessive corrosion which adversely affects braking or steering (6.1.a.1) 26 April 2007 [10:56] 26/04/2007 421386117100 421386117100
1 Nearside vehicle structure has excessive corrosion which adversely affects braking or steering (6.1.a.1) Nearside vehicle structure has excessive corrosion which adversely affects braking or steering (6.1.a.1) 26 April 2007 [10:56] 26/04/2007 421386117100 421386117100
1 Nearside steering rack gaiter split (2.2.d.2d) Nearside steering rack gaiter split (2.2.d.2d) 01 June 2006 [14:22] 01/06/2006 604492856152 604492856152
1 Offside front suspension arm has excessive play in a pin/bush (2.4.g.2) Offside front suspension arm has excessive play in a pin/bush (2.4.g.2) 01 June 2006 [14:22] 01/06/2006 604492856152 604492856152
1 Offside rear shock absorber has a serious fluid leak (2.7.3) Offside rear shock absorber has a serious fluid leak (2.7.3) 01 June 2006 [14:22] 01/06/2006 604492856152 604492856152
1 Nearside suspension component mounting prescribed area is excessively corroded (2.4.a.3) Nearside suspension component mounting prescribed area is excessively corroded (2.4.a.3) 01 June 2006 [14:22] 01/06/2006 604492856152 604492856152
1 Offside suspension component mounting prescribed area is excessively corroded (2.4.a.3) Offside suspension component mounting prescribed area is excessively corroded (2.4.a.3) 01 June 2006 [14:22] 01/06/2006 604492856152 604492856152
1 Offside front suspension component mounting prescribed area is excessively corroded (2.4.a.3) Offside front suspension component mounting prescribed area is excessively corroded (2.4.a.3) 01 June 2006 [14:22] 01/06/2006 604492856152 604492856152
1 Nearside seat belt anchorage prescribed area is excessively corroded (5.2.6) Nearside seat belt anchorage prescribed area is excessively corroded (5.2.6) 01 June 2006 [14:22] 01/06/2006 604492856152 604492856152
1 Offside seat belt anchorage prescribed area is excessively corroded (5.2.6) Offside seat belt anchorage prescribed area is excessively corroded (5.2.6) 01 June 2006 [14:22] 01/06/2006 604492856152 604492856152
1 Offside rear suspension spring mounting prescribed area is excessively corroded (2.4.a.3) Offside rear suspension spring mounting prescribed area is excessively corroded (2.4.a.3) 01 June 2006 [14:22] 01/06/2006 604492856152 604492856152
1 Offside rear parking brake recording little or no effort (3.7.b.6a) Offside rear parking brake recording little or no effort (3.7.b.6a) 01 June 2006 [14:22] 01/06/2006 604492856152 604492856152

ALL 1NLH User Entered Faults [1]

ALL User Entered faults, ORDERED by OCCURRENCE DURING 1NLH's MOT HISTORY
ALL 1NLH User Entered Faults [1]
ALL User Entered faults, ORDERED by OCCURRENCE DURING 1NLH's MOT HISTORY
Fail Faults | source www.vehiclestats.co.uk
Fault Fault Test Date Test Date/Time Reference MOT Test Reference
1 Structer to boot aera corroded brackets to under side bonett broken Structer to boot aera corroded brackets to under side bonett broken 26 April 2007 [10:56] 26/04/2007 421386117100 421386117100

ALL 1NLH Pass With Rectification Faults [3]

ALL Pass With Rectification faults, ORDERED by OCCURRENCE DURING 1NLH's MOT HISTORY
ALL 1NLH Pass With Rectification Faults [3]
ALL Pass With Rectification faults, ORDERED by OCCURRENCE DURING 1NLH's MOT HISTORY
Pass With Rectification Faults | source www.vehiclestats.co.uk
Fault Fault Test Date Test Date/Time Reference MOT Test Reference
1 Registration plate lamp not working (1.1.5c) Registration plate lamp not working (1.1.5c) 08 November 2007 [12:13] 08/11/2007 204902117369 204902117369
1 Nearside stop lamp not working (1.2.1b) Nearside stop lamp not working (1.2.1b) 08 November 2007 [12:13] 08/11/2007 204902117369 204902117369
1 Nearside front brake pipe inadequately clipped (3.6.b.1) Nearside front brake pipe inadequately clipped (3.6.b.1) 08 November 2007 [12:13] 08/11/2007 204902117369 204902117369

MOT TEST: 01 November 2017 13:15:52 PASSED
MOT TEST: 01 November 2017 13:15:52 PASSED

This test (457490971033) was completed on the 01 November 2017 13:15:52 and PASSED the requirements for a valid MOT with 0 comments.

This test (457490971033) was completed on the 01 November 2017 13:15:52 and PASSED the requirements for a valid MOT with 0 comments.

Recorded mileage: 36,946

Recorded mileage: 36,946


MOT TEST: 25 October 2016 11:58:13 PASSED
MOT TEST: 25 October 2016 11:58:13 PASSED

This test (743311428270) was completed on the 25 October 2016 11:58:13 and PASSED the requirements for a valid MOT with 0 comments.

This test (743311428270) was completed on the 25 October 2016 11:58:13 and PASSED the requirements for a valid MOT with 0 comments.

Recorded mileage: 36,943

Recorded mileage: 36,943


MOT TEST: 20 October 2015 10:33:10 PASSED
MOT TEST: 20 October 2015 10:33:10 PASSED

This test (602965995740) was completed on the 20 October 2015 10:33:10 and PASSED the requirements for a valid MOT with 0 comments.

This test (602965995740) was completed on the 20 October 2015 10:33:10 and PASSED the requirements for a valid MOT with 0 comments.

Recorded mileage: 36,938

Recorded mileage: 36,938


MOT TEST: 13 October 2014 13:15:37 PASSED
MOT TEST: 13 October 2014 13:15:37 PASSED

This test (459356884231) was completed on the 13 October 2014 13:15:37 and PASSED the requirements for a valid MOT with 0 comments.

This test (459356884231) was completed on the 13 October 2014 13:15:37 and PASSED the requirements for a valid MOT with 0 comments.

Recorded mileage: 36,935

Recorded mileage: 36,935


MOT TEST: 17 October 2013 09:13:54 PASSED
MOT TEST: 17 October 2013 09:13:54 PASSED

This test (367390593481) was completed on the 17 October 2013 09:13:54 and PASSED the requirements for a valid MOT with 0 comments.

This test (367390593481) was completed on the 17 October 2013 09:13:54 and PASSED the requirements for a valid MOT with 0 comments.

Recorded mileage: 36,920

Recorded mileage: 36,920


MOT TEST: 14 October 2013 11:24:03 FAILED
MOT TEST: 14 October 2013 11:24:03 FAILED

This test (325557383269) was completed on the 14 October 2013 11:24:03 and FAILED the requirements for a valid MOT with 6 comments.

This test (325557383269) was completed on the 14 October 2013 11:24:03 and FAILED the requirements for a valid MOT with 6 comments.

Recorded mileage: 36,920

Recorded mileage: 36,920


FAIL


MOT TEST: 25 October 2012 10:13:06 PASSED
MOT TEST: 25 October 2012 10:13:06 PASSED

This test (187059292283) was completed on the 25 October 2012 10:13:06 and PASSED the requirements for a valid MOT with 0 comments.

This test (187059292283) was completed on the 25 October 2012 10:13:06 and PASSED the requirements for a valid MOT with 0 comments.

Recorded mileage: 36,917

Recorded mileage: 36,917


MOT TEST: 04 November 2011 12:35:29 PASSED
MOT TEST: 04 November 2011 12:35:29 PASSED

This test (686838501302) was completed on the 04 November 2011 12:35:29 and PASSED the requirements for a valid MOT with 0 comments.

This test (686838501302) was completed on the 04 November 2011 12:35:29 and PASSED the requirements for a valid MOT with 0 comments.

Recorded mileage: 36,909

Recorded mileage: 36,909


MOT TEST: 06 November 2010 09:50:27 PASSED
MOT TEST: 06 November 2010 09:50:27 PASSED

This test (372430710346) was completed on the 06 November 2010 09:50:27 and PASSED the requirements for a valid MOT with 0 comments.

This test (372430710346) was completed on the 06 November 2010 09:50:27 and PASSED the requirements for a valid MOT with 0 comments.

Recorded mileage: 36,901

Recorded mileage: 36,901


MOT TEST: 10 October 2009 10:25:28 PASSED
MOT TEST: 10 October 2009 10:25:28 PASSED

This test (441473689286) was completed on the 10 October 2009 10:25:28 and PASSED the requirements for a valid MOT with 0 comments.

This test (441473689286) was completed on the 10 October 2009 10:25:28 and PASSED the requirements for a valid MOT with 0 comments.

Recorded mileage: 36,891

Recorded mileage: 36,891


MOT TEST: 11 October 2008 10:47:34 PASSED
MOT TEST: 11 October 2008 10:47:34 PASSED

This test (340415388248) was completed on the 11 October 2008 10:47:34 and PASSED the requirements for a valid MOT with 0 comments.

This test (340415388248) was completed on the 11 October 2008 10:47:34 and PASSED the requirements for a valid MOT with 0 comments.

Recorded mileage: 36,846

Recorded mileage: 36,846


MOT TEST: 08 November 2007 12:13:38 FAILED
MOT TEST: 08 November 2007 12:13:38 FAILED

This test (204902117369) was completed on the 08 November 2007 12:13:38 and FAILED the requirements for a valid MOT with 3 comments.

This test (204902117369) was completed on the 08 November 2007 12:13:38 and FAILED the requirements for a valid MOT with 3 comments.

Recorded mileage: 36,770

Recorded mileage: 36,770


PASS WITH RECTIFICATION


MOT TEST: 08 November 2007 12:13:38 PASSED
MOT TEST: 08 November 2007 12:13:38 PASSED

This test (462992317467) was completed on the 08 November 2007 12:13:38 and PASSED the requirements for a valid MOT with 0 comments.

This test (462992317467) was completed on the 08 November 2007 12:13:38 and PASSED the requirements for a valid MOT with 0 comments.

Recorded mileage: 36,770

Recorded mileage: 36,770


MOT TEST: 26 April 2007 10:56:10 FAILED
MOT TEST: 26 April 2007 10:56:10 FAILED

This test (421386117100) was completed on the 26 April 2007 10:56:10 and FAILED the requirements for a valid MOT with 10 comments.

This test (421386117100) was completed on the 26 April 2007 10:56:10 and FAILED the requirements for a valid MOT with 10 comments.

Recorded mileage: 36,714

Recorded mileage: 36,714


FAIL

USER ENTERED


MOT TEST: 22 June 2006 13:08:18 PASSED
MOT TEST: 22 June 2006 13:08:18 PASSED

This test (722903776193) was completed on the 22 June 2006 13:08:18 and PASSED the requirements for a valid MOT with 0 comments.

This test (722903776193) was completed on the 22 June 2006 13:08:18 and PASSED the requirements for a valid MOT with 0 comments.

Recorded mileage: 35,751

Recorded mileage: 35,751


MOT TEST: 01 June 2006 14:22:59 FAILED
MOT TEST: 01 June 2006 14:22:59 FAILED

This test (604492856152) was completed on the 01 June 2006 14:22:59 and FAILED the requirements for a valid MOT with 12 comments.

This test (604492856152) was completed on the 01 June 2006 14:22:59 and FAILED the requirements for a valid MOT with 12 comments.

Recorded mileage: 35,750

Recorded mileage: 35,750


FAIL