203 XUK


203XUK is registered to a Green 1962, Morris Minor 1000 with a Petrol engine. It Failed its most recent MOT Test on the 19 November 2007

10 unique faults (10 Total) reported in its MOT History (2 Tests).

0 common/recurring faults.

50% (1) MOT Pass Rate and a 50% (1) MOT Failure Rate.

11,838 recorded miles.

203 XUK


203XUK is registered to a Green 1962, Morris Minor 1000 with a Petrol engine. It Failed its most recent MOT Test on the 19 November 2007

10 unique faults (10 Total) reported in its MOT History (2 Tests).

0 common/recurring faults.

50% (1) MOT Pass Rate and a 50% (1) MOT Failure Rate.

11,838 recorded miles.

MOT PASS/Failure rate for 203 XUK

all MOT test results for 203 XUK represented as a percentage
MOT PASS/Failure rate for 203 XUK
all MOT test results for 203 XUK represented as a percentage

PERCENTAGE OF VEHICLE FAULTS WITH 203 XUK

ALL REPORTED FAULTS, DISPLAYED BY PERCENTAGE OF OCCURRENCE DURING ALL MOT TESTS
PERCENTAGE OF VEHICLE FAULTS WITH 203 XUK
ALL REPORTED FAULTS, DISPLAYED BY PERCENTAGE OF OCCURRENCE DURING ALL MOT TESTS
FAIL

203 XUK annual Faults by type

ALL REPORTED FAULTS, DISPLAYED over time and categorised by type
203 XUK annual Faults by type
ALL REPORTED FAULTS, DISPLAYED over time and categorised by type

ALL 203 XUK Failure Faults [10]

ALL Failure faults, ORDERED by OCCURRENCE DURING 203 XUK's MOT HISTORY
ALL 203 XUK Failure Faults [10]
ALL Failure faults, ORDERED by OCCURRENCE DURING 203 XUK's MOT HISTORY
Fail Faults | source www.vehiclestats.co.uk
Fault Fault Test Date Test Date/Time Reference MOT Test Reference
1 Nearside rear position lamp(s) excessively deteriorated so that it is not visible from a reasonable distance (1.1.a.3d) Nearside rear position lamp(s) excessively deteriorated so that it is not visible from a reasonable distance (1.1.a.3d) 06 November 2007 [14:06] 06/11/2007 691490017335 691490017335
1 Horn not working (1.6.2a) Horn not working (1.6.2a) 06 November 2007 [14:06] 06/11/2007 691490017335 691490017335
1 Offside front brake pipe excessively corroded (3.6.b.2c) Offside front brake pipe excessively corroded (3.6.b.2c) 06 November 2007 [14:06] 06/11/2007 691490017335 691490017335
1 Front brake pipe excessively corroded (3.6.b.2c) Front brake pipe excessively corroded (3.6.b.2c) 06 November 2007 [14:06] 06/11/2007 691490017335 691490017335
1 Nearside rear brake pipe excessively corroded (3.6.b.2c) Nearside rear brake pipe excessively corroded (3.6.b.2c) 06 November 2007 [14:06] 06/11/2007 691490017335 691490017335
1 Offside rear brake pipe excessively corroded (3.6.b.2c) Offside rear brake pipe excessively corroded (3.6.b.2c) 06 November 2007 [14:06] 06/11/2007 691490017335 691490017335
1 Offside front suspension component mounting prescribed area is excessively corroded (2.4.a.3) Offside front suspension component mounting prescribed area is excessively corroded (2.4.a.3) 06 November 2007 [14:06] 06/11/2007 691490017335 691490017335
1 Offside rear suspension component mounting prescribed area is excessively corroded (2.4.a.3) Offside rear suspension component mounting prescribed area is excessively corroded (2.4.a.3) 06 November 2007 [14:06] 06/11/2007 691490017335 691490017335
1 Offside rear suspension spring mounting prescribed area is excessively corroded (2.4.a.3) Offside rear suspension spring mounting prescribed area is excessively corroded (2.4.a.3) 06 November 2007 [14:06] 06/11/2007 691490017335 691490017335
1 Service brake: efficiency below requirements (3.7.b.7) Service brake: efficiency below requirements (3.7.b.7) 06 November 2007 [14:06] 06/11/2007 691490017335 691490017335

MOT TEST: 19 November 2007 09:58:05 PASSED
MOT TEST: 19 November 2007 09:58:05 PASSED

This test (952463627363) was completed on the 19 November 2007 09:58:05 and PASSED the requirements for a valid MOT with 0 comments.

This test (952463627363) was completed on the 19 November 2007 09:58:05 and PASSED the requirements for a valid MOT with 0 comments.

Recorded mileage: 11,838

Recorded mileage: 11,838


MOT TEST: 06 November 2007 14:06:14 FAILED
MOT TEST: 06 November 2007 14:06:14 FAILED

This test (691490017335) was completed on the 06 November 2007 14:06:14 and FAILED the requirements for a valid MOT with 10 comments.

This test (691490017335) was completed on the 06 November 2007 14:06:14 and FAILED the requirements for a valid MOT with 10 comments.

Recorded mileage: 11,838

Recorded mileage: 11,838


FAIL