221 9SZ


2219SZ is registered to a Grey 1966, Morris Minor with a Petrol engine. It Passed its most recent MOT Test on the 26 March 2018

11 unique faults (11 Total) reported in its MOT History (3 Tests).

0 common/recurring faults.

67% (2) MOT Pass Rate and a 33% (1) MOT Failure Rate.

54,745 recorded miles.

221 9SZ


2219SZ is registered to a Grey 1966, Morris Minor with a Petrol engine. It Passed its most recent MOT Test on the 26 March 2018

11 unique faults (11 Total) reported in its MOT History (3 Tests).

0 common/recurring faults.

67% (2) MOT Pass Rate and a 33% (1) MOT Failure Rate.

54,745 recorded miles.

MOT PASS/Failure rate for 221 9SZ

all MOT test results for 221 9SZ represented as a percentage
MOT PASS/Failure rate for 221 9SZ
all MOT test results for 221 9SZ represented as a percentage

PERCENTAGE OF VEHICLE FAULTS WITH 221 9SZ

ALL REPORTED FAULTS, DISPLAYED BY PERCENTAGE OF OCCURRENCE DURING ALL MOT TESTS
PERCENTAGE OF VEHICLE FAULTS WITH 221 9SZ
ALL REPORTED FAULTS, DISPLAYED BY PERCENTAGE OF OCCURRENCE DURING ALL MOT TESTS
FAIL

221 9SZ annual Faults by type

ALL REPORTED FAULTS, DISPLAYED over time and categorised by type
221 9SZ annual Faults by type
ALL REPORTED FAULTS, DISPLAYED over time and categorised by type

ALL 221 9SZ Failure Faults [11]

ALL Failure faults, ORDERED by OCCURRENCE DURING 221 9SZ's MOT HISTORY
ALL 221 9SZ Failure Faults [11]
ALL Failure faults, ORDERED by OCCURRENCE DURING 221 9SZ's MOT HISTORY
Fail Faults | source www.vehiclestats.co.uk
Fault Fault Test Date Test Date/Time Reference MOT Test Reference
1 Nearside rear suspension spring mounting prescribed area is excessively corroded (2.4.a.3) Nearside rear suspension spring mounting prescribed area is excessively corroded (2.4.a.3) 26 June 2006 [15:28] 26/06/2006 792287176162 792287176162
1 Offside rear suspension spring mounting prescribed area is excessively corroded (2.4.a.3) Offside rear suspension spring mounting prescribed area is excessively corroded (2.4.a.3) 26 June 2006 [15:28] 26/06/2006 792287176162 792287176162
1 Offside seat belt anchorage prescribed area is excessively corroded (5.2.6) Offside seat belt anchorage prescribed area is excessively corroded (5.2.6) 26 June 2006 [15:28] 26/06/2006 792287176162 792287176162
1 Offside front suspension component mounting prescribed area is excessively corroded (2.4.a.3) Offside front suspension component mounting prescribed area is excessively corroded (2.4.a.3) 26 June 2006 [15:28] 26/06/2006 792287176162 792287176162
1 Nearside front suspension component mounting prescribed area is excessively corroded (2.4.a.3) Nearside front suspension component mounting prescribed area is excessively corroded (2.4.a.3) 26 June 2006 [15:28] 26/06/2006 792287176162 792287176162
1 Nearside front brake binding (3.7.b.1) Nearside front brake binding (3.7.b.1) 26 June 2006 [15:28] 26/06/2006 792287176162 792287176162
1 Offside front brake binding (3.7.b.1) Offside front brake binding (3.7.b.1) 26 June 2006 [15:28] 26/06/2006 792287176162 792287176162
1 Offside rear brake binding (3.7.b.1) Offside rear brake binding (3.7.b.1) 26 June 2006 [15:28] 26/06/2006 792287176162 792287176162
1 Nearside windscreen wiper blade deteriorated (8.2.2) Nearside windscreen wiper blade deteriorated (8.2.2) 26 June 2006 [15:28] 26/06/2006 792287176162 792287176162
1 Windscreen washer provides insufficient washer liquid (8.2.3) Windscreen washer provides insufficient washer liquid (8.2.3) 26 June 2006 [15:28] 26/06/2006 792287176162 792287176162
1 Horn not working (1.6.2a) Horn not working (1.6.2a) 26 June 2006 [15:28] 26/06/2006 792287176162 792287176162

MOT TEST: 26 March 2018 13:15:43 PASSED
MOT TEST: 26 March 2018 13:15:43 PASSED

This test (723077751416) was completed on the 26 March 2018 13:15:43 and PASSED the requirements for a valid MOT with 0 comments.

This test (723077751416) was completed on the 26 March 2018 13:15:43 and PASSED the requirements for a valid MOT with 0 comments.

Recorded mileage: 54,745

Recorded mileage: 54,745


MOT TEST: 03 April 2017 14:11:05 PASSED
MOT TEST: 03 April 2017 14:11:05 PASSED

This test (832594915914) was completed on the 03 April 2017 14:11:05 and PASSED the requirements for a valid MOT with 0 comments.

This test (832594915914) was completed on the 03 April 2017 14:11:05 and PASSED the requirements for a valid MOT with 0 comments.

Recorded mileage: 54,606

Recorded mileage: 54,606


MOT TEST: 26 June 2006 15:28:57 FAILED
MOT TEST: 26 June 2006 15:28:57 FAILED

This test (792287176162) was completed on the 26 June 2006 15:28:57 and FAILED the requirements for a valid MOT with 11 comments.

This test (792287176162) was completed on the 26 June 2006 15:28:57 and FAILED the requirements for a valid MOT with 11 comments.

Recorded mileage: 54,589

Recorded mileage: 54,589


FAIL