227 HAA


227HAA is registered to a Green 1963, Morris Minor 1000 with a Petrol engine. It Passed its most recent MOT Test on the 24 April 2019

14 unique faults (14 Total) reported in its MOT History (16 Tests).

0 common/recurring faults.

75% (12) MOT Pass Rate and a 25% (4) MOT Failure Rate.

34,521 recorded miles.

227 HAA


227HAA is registered to a Green 1963, Morris Minor 1000 with a Petrol engine. It Passed its most recent MOT Test on the 24 April 2019

14 unique faults (14 Total) reported in its MOT History (16 Tests).

0 common/recurring faults.

75% (12) MOT Pass Rate and a 25% (4) MOT Failure Rate.

34,521 recorded miles.

MOT PASS/Failure rate for 227 HAA

all MOT test results for 227 HAA represented as a percentage
MOT PASS/Failure rate for 227 HAA
all MOT test results for 227 HAA represented as a percentage

PERCENTAGE OF VEHICLE FAULTS WITH 227 HAA

ALL REPORTED FAULTS, DISPLAYED BY PERCENTAGE OF OCCURRENCE DURING ALL MOT TESTS
PERCENTAGE OF VEHICLE FAULTS WITH 227 HAA
ALL REPORTED FAULTS, DISPLAYED BY PERCENTAGE OF OCCURRENCE DURING ALL MOT TESTS
ADVISORY

FAIL

USER ENTERED

PASS WITH RECTIFICATION

227 HAA annual Faults by type

ALL REPORTED FAULTS, DISPLAYED over time and categorised by type
227 HAA annual Faults by type
ALL REPORTED FAULTS, DISPLAYED over time and categorised by type

ALL 227 HAA ADVISORIES [3]

ALL ADVISORIES, ORDERED by OCCURRENCE DURING 227 HAA's MOT HISTORY
ALL 227 HAA ADVISORIES [3]
ALL ADVISORIES, ORDERED by OCCURRENCE DURING 227 HAA's MOT HISTORY
Advisory Faults | source www.vehiclestats.co.uk
Fault Fault Test Date Test Date/Time Reference MOT Test Reference
1 Offside front inner vehicle structure is corroded but structural rigidity is not significantly reduced wing (6.1.1 (c) (i)) Offside front inner vehicle structure is corroded but structural rigidity is not significantly reduced wing (6.1.1 (c) (i)) 24 April 2019 [12:04] 24/04/2019 162887424585 162887424585
1 Offside front vehicle structure has slight corrosion (6.1.a.1) Offside front vehicle structure has slight corrosion (6.1.a.1) 27 April 2015 [10:21] 27/04/2015 807887715159 807887715159
1 Nearside rear vehicle structure has slight corrosion (6.1.a.1) Nearside rear vehicle structure has slight corrosion (6.1.a.1) 22 April 2014 [14:20] 22/04/2014 597892514158 597892514158

ALL 227 HAA Failure Faults [9]

ALL Failure faults, ORDERED by OCCURRENCE DURING 227 HAA's MOT HISTORY
ALL 227 HAA Failure Faults [9]
ALL Failure faults, ORDERED by OCCURRENCE DURING 227 HAA's MOT HISTORY
Fail Faults | source www.vehiclestats.co.uk
Fault Fault Test Date Test Date/Time Reference MOT Test Reference
1 Nearside front brake juddering severely (3.7.a.2b) Nearside front brake juddering severely (3.7.a.2b) 25 April 2013 [10:40] 25/04/2013 857755613115 857755613115
1 Inner front vehicle structure has excessive corrosion, seriously affecting its strength within 30cm of the body mountings (6.1.b.2) Inner front vehicle structure has excessive corrosion, seriously affecting its strength within 30cm of the body mountings (6.1.b.2) 25 April 2013 [10:40] 25/04/2013 857755613115 857755613115
1 Offside front vehicle structure has excessive corrosion, seriously affecting its strength within 30cm of the body mountings (6.1.b.2) Offside front vehicle structure has excessive corrosion, seriously affecting its strength within 30cm of the body mountings (6.1.b.2) 25 April 2013 [10:40] 25/04/2013 857755613115 857755613115
1 Parking brake: efficiency below requirements (3.7.b.7) Parking brake: efficiency below requirements (3.7.b.7) 25 April 2013 [10:40] 25/04/2013 857755613115 857755613115
1 Brakes imbalanced across an axle (3.7.b.5b) Brakes imbalanced across an axle (3.7.b.5b) 25 April 2013 [10:40] 25/04/2013 857755613115 857755613115
1 Nearside front vehicle structure has excessive corrosion, seriously affecting its strength within 30cm of the body mountings (6.1.b.2) Nearside front vehicle structure has excessive corrosion, seriously affecting its strength within 30cm of the body mountings (6.1.b.2) 04 April 2012 [13:49] 04/04/2012 179635092031 179635092031
1 Nearside rear shock absorber has a serious fluid leak (2.7.3) Nearside rear shock absorber has a serious fluid leak (2.7.3) 04 April 2011 [11:38] 04/04/2011 578684091060 578684091060
1 Rear shock absorber has a serious fluid leak (2.7.3) Rear shock absorber has a serious fluid leak (2.7.3) 04 April 2011 [11:38] 04/04/2011 578684091060 578684091060
1 Upper steering pivot point has excessive play (2.2.b.1g) Upper steering pivot point has excessive play (2.2.b.1g) 04 April 2011 [11:38] 04/04/2011 578684091060 578684091060

ALL 227 HAA User Entered Faults [1]

ALL User Entered faults, ORDERED by OCCURRENCE DURING 227 HAA's MOT HISTORY
ALL 227 HAA User Entered Faults [1]
ALL User Entered faults, ORDERED by OCCURRENCE DURING 227 HAA's MOT HISTORY
User Entered Faults | source www.vehiclestats.co.uk
Fault Fault Test Date Test Date/Time Reference MOT Test Reference
1 Oil leak Oil leak 29 April 2010 [16:01] 29/04/2010 363399610101 363399610101

ALL 227 HAA Pass With Rectification Faults [1]

ALL Pass With Rectification faults, ORDERED by OCCURRENCE DURING 227 HAA's MOT HISTORY
ALL 227 HAA Pass With Rectification Faults [1]
ALL Pass With Rectification faults, ORDERED by OCCURRENCE DURING 227 HAA's MOT HISTORY
Pass With Rectification Faults | source www.vehiclestats.co.uk
Fault Fault Test Date Test Date/Time Reference MOT Test Reference
1 Registration plate lamp not working (1.1.5c) Registration plate lamp not working (1.1.5c) 11 July 2007 [09:16] 11/07/2007 290052397427 290052397427

MOT TEST: 24 April 2019 12:04:52 PASSED
MOT TEST: 24 April 2019 12:04:52 PASSED

This test (162887424585) was completed on the 24 April 2019 12:04:52 and PASSED the requirements for a valid MOT with 1 comments.

This test (162887424585) was completed on the 24 April 2019 12:04:52 and PASSED the requirements for a valid MOT with 1 comments.

Recorded mileage: 34,521

Recorded mileage: 34,521


ADVISORY


MOT TEST: 26 April 2018 14:39:52 PASSED
MOT TEST: 26 April 2018 14:39:52 PASSED

This test (550696043570) was completed on the 26 April 2018 14:39:52 and PASSED the requirements for a valid MOT with 0 comments.

This test (550696043570) was completed on the 26 April 2018 14:39:52 and PASSED the requirements for a valid MOT with 0 comments.

Recorded mileage: 34,211

Recorded mileage: 34,211


MOT TEST: 24 April 2017 09:15:15 PASSED
MOT TEST: 24 April 2017 09:15:15 PASSED

This test (427809651231) was completed on the 24 April 2017 09:15:15 and PASSED the requirements for a valid MOT with 0 comments.

This test (427809651231) was completed on the 24 April 2017 09:15:15 and PASSED the requirements for a valid MOT with 0 comments.

Recorded mileage: 33,649

Recorded mileage: 33,649


MOT TEST: 13 April 2016 11:49:35 PASSED
MOT TEST: 13 April 2016 11:49:35 PASSED

This test (961598295992) was completed on the 13 April 2016 11:49:35 and PASSED the requirements for a valid MOT with 0 comments.

This test (961598295992) was completed on the 13 April 2016 11:49:35 and PASSED the requirements for a valid MOT with 0 comments.

Recorded mileage: 33,503

Recorded mileage: 33,503


MOT TEST: 27 April 2015 10:21:30 PASSED
MOT TEST: 27 April 2015 10:21:30 PASSED

This test (807887715159) was completed on the 27 April 2015 10:21:30 and PASSED the requirements for a valid MOT with 1 comments.

This test (807887715159) was completed on the 27 April 2015 10:21:30 and PASSED the requirements for a valid MOT with 1 comments.

Recorded mileage: 31,694

Recorded mileage: 31,694


ADVISORY


MOT TEST: 22 April 2014 14:20:53 PASSED
MOT TEST: 22 April 2014 14:20:53 PASSED

This test (597892514158) was completed on the 22 April 2014 14:20:53 and PASSED the requirements for a valid MOT with 1 comments.

This test (597892514158) was completed on the 22 April 2014 14:20:53 and PASSED the requirements for a valid MOT with 1 comments.

Recorded mileage: 29,652

Recorded mileage: 29,652


ADVISORY


MOT TEST: 25 April 2013 14:26:03 PASSED
MOT TEST: 25 April 2013 14:26:03 PASSED

This test (825425113106) was completed on the 25 April 2013 14:26:03 and PASSED the requirements for a valid MOT with 0 comments.

This test (825425113106) was completed on the 25 April 2013 14:26:03 and PASSED the requirements for a valid MOT with 0 comments.

Recorded mileage: 28,534

Recorded mileage: 28,534


MOT TEST: 25 April 2013 10:40:32 FAILED
MOT TEST: 25 April 2013 10:40:32 FAILED

This test (857755613115) was completed on the 25 April 2013 10:40:32 and FAILED the requirements for a valid MOT with 5 comments.

This test (857755613115) was completed on the 25 April 2013 10:40:32 and FAILED the requirements for a valid MOT with 5 comments.

Recorded mileage: 28,530

Recorded mileage: 28,530


FAIL


MOT TEST: 04 April 2012 15:01:59 PASSED
MOT TEST: 04 April 2012 15:01:59 PASSED

This test (439835692007) was completed on the 04 April 2012 15:01:59 and PASSED the requirements for a valid MOT with 0 comments.

This test (439835692007) was completed on the 04 April 2012 15:01:59 and PASSED the requirements for a valid MOT with 0 comments.

Recorded mileage: 26,769

Recorded mileage: 26,769


MOT TEST: 04 April 2012 13:49:52 FAILED
MOT TEST: 04 April 2012 13:49:52 FAILED

This test (179635092031) was completed on the 04 April 2012 13:49:52 and FAILED the requirements for a valid MOT with 1 comments.

This test (179635092031) was completed on the 04 April 2012 13:49:52 and FAILED the requirements for a valid MOT with 1 comments.

Recorded mileage: 26,765

Recorded mileage: 26,765


FAIL


MOT TEST: 04 April 2011 15:24:56 PASSED
MOT TEST: 04 April 2011 15:24:56 PASSED

This test (828194691082) was completed on the 04 April 2011 15:24:56 and PASSED the requirements for a valid MOT with 0 comments.

This test (828194691082) was completed on the 04 April 2011 15:24:56 and PASSED the requirements for a valid MOT with 0 comments.

Recorded mileage: 21,646

Recorded mileage: 21,646


MOT TEST: 04 April 2011 11:38:53 FAILED
MOT TEST: 04 April 2011 11:38:53 FAILED

This test (578684091060) was completed on the 04 April 2011 11:38:53 and FAILED the requirements for a valid MOT with 3 comments.

This test (578684091060) was completed on the 04 April 2011 11:38:53 and FAILED the requirements for a valid MOT with 3 comments.

Recorded mileage: 21,644

Recorded mileage: 21,644


FAIL


MOT TEST: 29 April 2010 16:01:13 PASSED
MOT TEST: 29 April 2010 16:01:13 PASSED

This test (363399610101) was completed on the 29 April 2010 16:01:13 and PASSED the requirements for a valid MOT with 1 comments.

This test (363399610101) was completed on the 29 April 2010 16:01:13 and PASSED the requirements for a valid MOT with 1 comments.

Recorded mileage: 23,842

Recorded mileage: 23,842


USER ENTERED


MOT TEST: 11 July 2007 09:16:19 PASSED
MOT TEST: 11 July 2007 09:16:19 PASSED

This test (370012797110) was completed on the 11 July 2007 09:16:19 and PASSED the requirements for a valid MOT with 0 comments.

This test (370012797110) was completed on the 11 July 2007 09:16:19 and PASSED the requirements for a valid MOT with 0 comments.

Recorded mileage: 22,862

Recorded mileage: 22,862


MOT TEST: 11 July 2007 09:16:19 FAILED
MOT TEST: 11 July 2007 09:16:19 FAILED

This test (290052397427) was completed on the 11 July 2007 09:16:19 and FAILED the requirements for a valid MOT with 1 comments.

This test (290052397427) was completed on the 11 July 2007 09:16:19 and FAILED the requirements for a valid MOT with 1 comments.

Recorded mileage: 22,862

Recorded mileage: 22,862


PASS WITH RECTIFICATION


MOT TEST: 02 August 2006 11:52:01 PASSED
MOT TEST: 02 August 2006 11:52:01 PASSED

This test (820014616233) was completed on the 02 August 2006 11:52:01 and PASSED the requirements for a valid MOT with 0 comments.

This test (820014616233) was completed on the 02 August 2006 11:52:01 and PASSED the requirements for a valid MOT with 0 comments.

Recorded mileage: 21,586

Recorded mileage: 21,586