229 UYY


229UYY is registered to a White 1960, Morris Minor 1000 with a Petrol engine. It Failed its most recent MOT Test on the 03 August 2017

17 unique faults (17 Total) reported in its MOT History (12 Tests).

0 common/recurring faults.

67% (8) MOT Pass Rate and a 33% (4) MOT Failure Rate.

79,400 recorded miles.

229 UYY


229UYY is registered to a White 1960, Morris Minor 1000 with a Petrol engine. It Failed its most recent MOT Test on the 03 August 2017

17 unique faults (17 Total) reported in its MOT History (12 Tests).

0 common/recurring faults.

67% (8) MOT Pass Rate and a 33% (4) MOT Failure Rate.

79,400 recorded miles.

MOT PASS/Failure rate for 229 UYY

all MOT test results for 229 UYY represented as a percentage
MOT PASS/Failure rate for 229 UYY
all MOT test results for 229 UYY represented as a percentage

PERCENTAGE OF VEHICLE FAULTS WITH 229 UYY

ALL REPORTED FAULTS, DISPLAYED BY PERCENTAGE OF OCCURRENCE DURING ALL MOT TESTS
PERCENTAGE OF VEHICLE FAULTS WITH 229 UYY
ALL REPORTED FAULTS, DISPLAYED BY PERCENTAGE OF OCCURRENCE DURING ALL MOT TESTS
ADVISORY

FAIL

USER ENTERED

PASS WITH RECTIFICATION

229 UYY annual Faults by type

ALL REPORTED FAULTS, DISPLAYED over time and categorised by type
229 UYY annual Faults by type
ALL REPORTED FAULTS, DISPLAYED over time and categorised by type

ALL 229 UYY ADVISORIES [1]

ALL ADVISORIES, ORDERED by OCCURRENCE DURING 229 UYY's MOT HISTORY
ALL 229 UYY ADVISORIES [1]
ALL ADVISORIES, ORDERED by OCCURRENCE DURING 229 UYY's MOT HISTORY
Advisory Faults | source www.vehiclestats.co.uk
Fault Fault Test Date Test Date/Time Reference MOT Test Reference
1 Offside front wheel bearing has slight play (2.5.a.3c) Offside front wheel bearing has slight play (2.5.a.3c) 01 April 2009 [14:41] 01/04/2009 700321899083 700321899083

ALL 229 UYY Failure Faults [11]

ALL Failure faults, ORDERED by OCCURRENCE DURING 229 UYY's MOT HISTORY
ALL 229 UYY Failure Faults [11]
ALL Failure faults, ORDERED by OCCURRENCE DURING 229 UYY's MOT HISTORY
Fail Faults | source www.vehiclestats.co.uk
Fault Fault Test Date Test Date/Time Reference MOT Test Reference
1 Windscreen washer provides insufficient washer liquid (8.2.3) Windscreen washer provides insufficient washer liquid (8.2.3) 13 March 2008 [09:34] 13/03/2008 870243078050 870243078050
1 Front exhaust has a major leak of exhaust gases (7.1.2) Front exhaust has a major leak of exhaust gases (7.1.2) 13 March 2008 [09:34] 13/03/2008 870243078050 870243078050
1 Nearside inner front vehicle structure has excessive corrosion which adversely affects braking or steering (6.1.a.1) Nearside inner front vehicle structure has excessive corrosion which adversely affects braking or steering (6.1.a.1) 13 March 2008 [09:34] 13/03/2008 870243078050 870243078050
1 Offside rear suspension spring mounting prescribed area is excessively corroded (2.4.a.3) Offside rear suspension spring mounting prescribed area is excessively corroded (2.4.a.3) 13 March 2008 [09:34] 13/03/2008 870243078050 870243078050
1 Front windscreen washer provides insufficient washer liquid (8.2.3) Front windscreen washer provides insufficient washer liquid (8.2.3) 06 March 2007 [09:58] 06/03/2007 924125567014 924125567014
1 Horn not working (1.6.2a) Horn not working (1.6.2a) 06 March 2007 [09:58] 06/03/2007 924125567014 924125567014
1 Nearside front headlamp aim too low (1.8) Nearside front headlamp aim too low (1.8) 06 March 2007 [09:58] 06/03/2007 924125567014 924125567014
1 Offside front headlamp aim too low (1.8) Offside front headlamp aim too low (1.8) 06 March 2007 [09:58] 06/03/2007 924125567014 924125567014
1 Offside outer steering rack gaiter split (2.2.d.2d) Offside outer steering rack gaiter split (2.2.d.2d) 06 March 2007 [09:58] 06/03/2007 924125567014 924125567014
1 Offside front front brake binding (3.7.b.1) Offside front front brake binding (3.7.b.1) 06 March 2007 [09:58] 06/03/2007 924125567014 924125567014
1 Nearside rear front brake binding (3.7.b.1) Nearside rear front brake binding (3.7.b.1) 06 March 2007 [09:58] 06/03/2007 924125567014 924125567014

ALL 229 UYY User Entered Faults [3]

ALL User Entered faults, ORDERED by OCCURRENCE DURING 229 UYY's MOT HISTORY
ALL 229 UYY User Entered Faults [3]
ALL User Entered faults, ORDERED by OCCURRENCE DURING 229 UYY's MOT HISTORY
User Entered Faults | source www.vehiclestats.co.uk
Fault Fault Test Date Test Date/Time Reference MOT Test Reference
1 N/s and o/s bump stops missing N/s and o/s bump stops missing 24 March 2010 [11:57] 24/03/2010 760973180076 760973180076
1 Nearside outer track rod end joint cover split/missing Nearside outer track rod end joint cover split/missing 01 April 2009 [14:41] 01/04/2009 700321899083 700321899083
1 Suspension joint offside lower dust cover split/missing Suspension joint offside lower dust cover split/missing 01 April 2009 [14:41] 01/04/2009 700321899083 700321899083

ALL 229 UYY Pass With Rectification Faults [2]

ALL Pass With Rectification faults, ORDERED by OCCURRENCE DURING 229 UYY's MOT HISTORY
ALL 229 UYY Pass With Rectification Faults [2]
ALL Pass With Rectification faults, ORDERED by OCCURRENCE DURING 229 UYY's MOT HISTORY
Pass With Rectification Faults | source www.vehiclestats.co.uk
Fault Fault Test Date Test Date/Time Reference MOT Test Reference
1 Rear tyre(s) incorrect because different size tyres are fitted on the same axle. (4.1.a.1a) Rear tyre(s) incorrect because different size tyres are fitted on the same axle. (4.1.a.1a) 02 April 2012 [08:49] 02/04/2012 698183992074 698183992074
1 Offside front wheel bearing has excessive play (2.5.a.3c) Offside front wheel bearing has excessive play (2.5.a.3c) 30 March 2011 [08:50] 30/03/2011 419449581038 419449581038

MOT TEST: 03 August 2017 07:37:15 PASSED
MOT TEST: 03 August 2017 07:37:15 PASSED

This test (619657534482) was completed on the 03 August 2017 07:37:15 and PASSED the requirements for a valid MOT with 0 comments.

This test (619657534482) was completed on the 03 August 2017 07:37:15 and PASSED the requirements for a valid MOT with 0 comments.

Recorded mileage: 33,974

Recorded mileage: 33,974


MOT TEST: 02 April 2012 08:49:57 PASSED
MOT TEST: 02 April 2012 08:49:57 PASSED

This test (976653892092) was completed on the 02 April 2012 08:49:57 and PASSED the requirements for a valid MOT with 0 comments.

This test (976653892092) was completed on the 02 April 2012 08:49:57 and PASSED the requirements for a valid MOT with 0 comments.

Recorded mileage: 33,566

Recorded mileage: 33,566


MOT TEST: 02 April 2012 08:49:57 FAILED
MOT TEST: 02 April 2012 08:49:57 FAILED

This test (698183992074) was completed on the 02 April 2012 08:49:57 and FAILED the requirements for a valid MOT with 1 comments.

This test (698183992074) was completed on the 02 April 2012 08:49:57 and FAILED the requirements for a valid MOT with 1 comments.

Recorded mileage: 33,566

Recorded mileage: 33,566


PASS WITH RECTIFICATION


MOT TEST: 30 March 2011 08:50:58 FAILED
MOT TEST: 30 March 2011 08:50:58 FAILED

This test (419449581038) was completed on the 30 March 2011 08:50:58 and FAILED the requirements for a valid MOT with 1 comments.

This test (419449581038) was completed on the 30 March 2011 08:50:58 and FAILED the requirements for a valid MOT with 1 comments.

Recorded mileage: 32,723

Recorded mileage: 32,723


PASS WITH RECTIFICATION


MOT TEST: 30 March 2011 08:50:58 PASSED
MOT TEST: 30 March 2011 08:50:58 PASSED

This test (906179981075) was completed on the 30 March 2011 08:50:58 and PASSED the requirements for a valid MOT with 0 comments.

This test (906179981075) was completed on the 30 March 2011 08:50:58 and PASSED the requirements for a valid MOT with 0 comments.

Recorded mileage: 32,723

Recorded mileage: 32,723


MOT TEST: 24 March 2010 11:57:19 PASSED
MOT TEST: 24 March 2010 11:57:19 PASSED

This test (760973180076) was completed on the 24 March 2010 11:57:19 and PASSED the requirements for a valid MOT with 1 comments.

This test (760973180076) was completed on the 24 March 2010 11:57:19 and PASSED the requirements for a valid MOT with 1 comments.

Recorded mileage: 32,709

Recorded mileage: 32,709


USER ENTERED


MOT TEST: 01 April 2009 14:41:32 PASSED
MOT TEST: 01 April 2009 14:41:32 PASSED

This test (700321899083) was completed on the 01 April 2009 14:41:32 and PASSED the requirements for a valid MOT with 3 comments.

This test (700321899083) was completed on the 01 April 2009 14:41:32 and PASSED the requirements for a valid MOT with 3 comments.

Recorded mileage: 32,514

Recorded mileage: 32,514


ADVISORY

USER ENTERED


MOT TEST: 31 March 2008 16:34:18 PASSED
MOT TEST: 31 March 2008 16:34:18 PASSED

This test (100501498048) was completed on the 31 March 2008 16:34:18 and PASSED the requirements for a valid MOT with 0 comments.

This test (100501498048) was completed on the 31 March 2008 16:34:18 and PASSED the requirements for a valid MOT with 0 comments.

Recorded mileage: 31,964

Recorded mileage: 31,964


MOT TEST: 13 March 2008 09:34:24 FAILED
MOT TEST: 13 March 2008 09:34:24 FAILED

This test (870243078050) was completed on the 13 March 2008 09:34:24 and FAILED the requirements for a valid MOT with 4 comments.

This test (870243078050) was completed on the 13 March 2008 09:34:24 and FAILED the requirements for a valid MOT with 4 comments.

Recorded mileage: 31,964

Recorded mileage: 31,964


FAIL


MOT TEST: 23 March 2007 17:07:13 PASSED
MOT TEST: 23 March 2007 17:07:13 PASSED

This test (870752787045) was completed on the 23 March 2007 17:07:13 and PASSED the requirements for a valid MOT with 0 comments.

This test (870752787045) was completed on the 23 March 2007 17:07:13 and PASSED the requirements for a valid MOT with 0 comments.

Recorded mileage: 31,737

Recorded mileage: 31,737


MOT TEST: 06 March 2007 09:58:46 FAILED
MOT TEST: 06 March 2007 09:58:46 FAILED

This test (924125567014) was completed on the 06 March 2007 09:58:46 and FAILED the requirements for a valid MOT with 7 comments.

This test (924125567014) was completed on the 06 March 2007 09:58:46 and FAILED the requirements for a valid MOT with 7 comments.

Recorded mileage: 31,737

Recorded mileage: 31,737


FAIL


MOT TEST: 06 March 2006 16:39:41 PASSED
MOT TEST: 06 March 2006 16:39:41 PASSED

This test (924525466098) was completed on the 06 March 2006 16:39:41 and PASSED the requirements for a valid MOT with 0 comments.

This test (924525466098) was completed on the 06 March 2006 16:39:41 and PASSED the requirements for a valid MOT with 0 comments.

Recorded mileage: 79,400

Recorded mileage: 79,400