22DAA


22DAA is registered to a Red 1961, Morris Mini with a Petrol engine. It Failed its most recent MOT Test on the 08 May 2018

18 unique faults (19 Total) reported in its MOT History (14 Tests).

1 common/recurring faults.

86% (12) MOT Pass Rate and a 14% (2) MOT Failure Rate.

66,999 recorded miles.

22DAA


22DAA is registered to a Red 1961, Morris Mini with a Petrol engine. It Failed its most recent MOT Test on the 08 May 2018

18 unique faults (19 Total) reported in its MOT History (14 Tests).

1 common/recurring faults.

86% (12) MOT Pass Rate and a 14% (2) MOT Failure Rate.

66,999 recorded miles.

MOT PASS/Failure rate for 22DAA

all MOT test results for 22DAA represented as a percentage
MOT PASS/Failure rate for 22DAA
all MOT test results for 22DAA represented as a percentage

PERCENTAGE OF VEHICLE FAULTS WITH 22DAA

ALL REPORTED FAULTS, DISPLAYED BY PERCENTAGE OF OCCURRENCE DURING ALL MOT TESTS
PERCENTAGE OF VEHICLE FAULTS WITH 22DAA
ALL REPORTED FAULTS, DISPLAYED BY PERCENTAGE OF OCCURRENCE DURING ALL MOT TESTS
ADVISORY

FAIL

PASS WITH RECTIFICATION

22DAA annual Faults by type

ALL REPORTED FAULTS, DISPLAYED over time and categorised by type
22DAA annual Faults by type
ALL REPORTED FAULTS, DISPLAYED over time and categorised by type

ALL 22DAA ADVISORIES [12]

ALL ADVISORIES, ORDERED by OCCURRENCE DURING 22DAA's MOT HISTORY
ALL 22DAA ADVISORIES [12]
ALL ADVISORIES, ORDERED by OCCURRENCE DURING 22DAA's MOT HISTORY
Fail Faults | source www.vehiclestats.co.uk
Fault Fault Test Date Test Date/Time Reference MOT Test Reference
1 Nearside front front wheel bearing has slight play (2.5.a.3c) Nearside front front wheel bearing has slight play (2.5.a.3c) 08 May 2018 [11:12] 08/05/2018 851889896091 851889896091
1 Offside rear very slight binding Offside rear very slight binding 08 May 2018 [11:12] 08/05/2018 851889896091 851889896091
1 Nearside front body has slight corrosion (6.1.b.2) Nearside front body has slight corrosion (6.1.b.2) 08 May 2018 [11:12] 08/05/2018 851889896091 851889896091
1 Nearside front body has slight corrosion jacking point (6.1.b.2) Nearside front body has slight corrosion jacking point (6.1.b.2) 08 May 2018 [11:12] 08/05/2018 851889896091 851889896091
1 Nearside front axle king pin has slight play in pin and/or bush (2.5.a.3a) Nearside front axle king pin has slight play in pin and/or bush (2.5.a.3a) 05 November 2011 [12:38] 05/11/2011 317489101369 317489101369
1 Offside front axle king pin has slight play in pin and/or bush (2.5.a.3a) Offside front axle king pin has slight play in pin and/or bush (2.5.a.3a) 05 November 2011 [12:38] 05/11/2011 317489101369 317489101369
1 Nearside rear axle beam has slight vertical movement between stub axle and axle beam (2.5.a.1a) Nearside rear axle beam has slight vertical movement between stub axle and axle beam (2.5.a.1a) 05 November 2011 [12:38] 05/11/2011 317489101369 317489101369
1 Offside body has slight corrosion (6.1.b.2) Offside body has slight corrosion (6.1.b.2) 27 June 2009 [13:18] 27/06/2009 272608679407 272608679407
1 Nearside front wheel bearing has slight play (2.5.a.3c) Nearside front wheel bearing has slight play (2.5.a.3c) 09 June 2008 [15:54] 09/06/2008 453131768189 453131768189
1 Offside lower ball joint has slight play (2.2.b.1f) Offside lower ball joint has slight play (2.2.b.1f) 09 June 2008 [15:54] 09/06/2008 453131768189 453131768189
1 Nearside upper ball joint has slight play (2.2.b.1f) Nearside upper ball joint has slight play (2.2.b.1f) 09 June 2008 [15:54] 09/06/2008 453131768189 453131768189
1 Nearside rear radius arm has slight play in a pin/bush (2.4.g.2) Nearside rear radius arm has slight play in a pin/bush (2.4.g.2) 19 June 2007 [16:06] 19/06/2007 883410877121 883410877121

ALL 22DAA Failure Faults [5]

ALL Failure faults, ORDERED by OCCURRENCE DURING 22DAA's MOT HISTORY
ALL 22DAA Failure Faults [5]
ALL Failure faults, ORDERED by OCCURRENCE DURING 22DAA's MOT HISTORY
Fail Faults | source www.vehiclestats.co.uk
Fault Fault Test Date Test Date/Time Reference MOT Test Reference
1 Registration plate lamp not working (1.1.c.1d) Registration plate lamp not working (1.1.c.1d) 08 May 2018 [11:12] 08/05/2018 851889896091 851889896091
1 Offside front front constant velocity joint gaiter insecure to the extent that it no longer prevents the ingress of dirt etc (2.5.c.1a) Offside front front constant velocity joint gaiter insecure to the extent that it no longer prevents the ingress of dirt etc (2.5.c.1a) 08 May 2018 [11:12] 08/05/2018 851889896091 851889896091
1 Nearside rear mechanical brake component has restricted free movement (3.5.1k) Nearside rear mechanical brake component has restricted free movement (3.5.1k) 08 May 2018 [11:12] 08/05/2018 851889896091 851889896091
1 Rear brakes imbalanced across an axle axle 2 (3.7.b.5b) Rear brakes imbalanced across an axle axle 2 (3.7.b.5b) 08 May 2018 [11:12] 08/05/2018 851889896091 851889896091
1 Offside rear rear brake excessively fluctuating (3.7.b.3) Offside rear rear brake excessively fluctuating (3.7.b.3) 08 May 2018 [11:12] 08/05/2018 851889896091 851889896091

ALL 22DAA Pass With Rectification Faults [2]

ALL Pass With Rectification faults, ORDERED by OCCURRENCE DURING 22DAA's MOT HISTORY
ALL 22DAA Pass With Rectification Faults [2]
ALL Pass With Rectification faults, ORDERED by OCCURRENCE DURING 22DAA's MOT HISTORY
Pass With Rectification Faults | source www.vehiclestats.co.uk
Fault Fault Test Date Test Date/Time Reference MOT Test Reference
1 Registration plate lamp not working (1.1.c.1d) Registration plate lamp not working (1.1.c.1d) 08 May 2015 [11:29] 08/05/2015 259898425176 259898425176
1 Nearside stop lamp not working (1.2.1b) Nearside stop lamp not working (1.2.1b) 08 May 2015 [11:29] 08/05/2015 259898425176 259898425176

MOT TEST: 08 May 2018 11:12:32 FAILED
MOT TEST: 08 May 2018 11:12:32 FAILED

This test (851889896091) was completed on the 08 May 2018 11:12:32 and FAILED the requirements for a valid MOT with 9 comments.

This test (851889896091) was completed on the 08 May 2018 11:12:32 and FAILED the requirements for a valid MOT with 9 comments.

Recorded mileage: 66,999

Recorded mileage: 66,999


ADVISORY

FAIL


MOT TEST: 09 May 2017 10:28:42 PASSED
MOT TEST: 09 May 2017 10:28:42 PASSED

This test (561259594934) was completed on the 09 May 2017 10:28:42 and PASSED the requirements for a valid MOT with 0 comments.

This test (561259594934) was completed on the 09 May 2017 10:28:42 and PASSED the requirements for a valid MOT with 0 comments.

Recorded mileage: 66,233

Recorded mileage: 66,233


MOT TEST: 07 May 2016 11:26:41 PASSED
MOT TEST: 07 May 2016 11:26:41 PASSED

This test (234547817483) was completed on the 07 May 2016 11:26:41 and PASSED the requirements for a valid MOT with 0 comments.

This test (234547817483) was completed on the 07 May 2016 11:26:41 and PASSED the requirements for a valid MOT with 0 comments.

Recorded mileage: 65,984

Recorded mileage: 65,984


MOT TEST: 08 May 2015 11:29:18 PASSED
MOT TEST: 08 May 2015 11:29:18 PASSED

This test (256548825421) was completed on the 08 May 2015 11:29:18 and PASSED the requirements for a valid MOT with 0 comments.

This test (256548825421) was completed on the 08 May 2015 11:29:18 and PASSED the requirements for a valid MOT with 0 comments.

Recorded mileage: 65,526

Recorded mileage: 65,526


MOT TEST: 08 May 2015 11:29:18 FAILED
MOT TEST: 08 May 2015 11:29:18 FAILED

This test (259898425176) was completed on the 08 May 2015 11:29:18 and FAILED the requirements for a valid MOT with 2 comments.

This test (259898425176) was completed on the 08 May 2015 11:29:18 and FAILED the requirements for a valid MOT with 2 comments.

Recorded mileage: 65,526

Recorded mileage: 65,526


PASS WITH RECTIFICATION


MOT TEST: 02 May 2014 12:37:07 PASSED
MOT TEST: 02 May 2014 12:37:07 PASSED

This test (919952124109) was completed on the 02 May 2014 12:37:07 and PASSED the requirements for a valid MOT with 0 comments.

This test (919952124109) was completed on the 02 May 2014 12:37:07 and PASSED the requirements for a valid MOT with 0 comments.

Recorded mileage: 62,902

Recorded mileage: 62,902


MOT TEST: 03 November 2012 12:07:10 PASSED
MOT TEST: 03 November 2012 12:07:10 PASSED

This test (215518102395) was completed on the 03 November 2012 12:07:10 and PASSED the requirements for a valid MOT with 0 comments.

This test (215518102395) was completed on the 03 November 2012 12:07:10 and PASSED the requirements for a valid MOT with 0 comments.

Recorded mileage: 18,066

Recorded mileage: 18,066


MOT TEST: 05 November 2011 12:38:05 PASSED
MOT TEST: 05 November 2011 12:38:05 PASSED

This test (317489101369) was completed on the 05 November 2011 12:38:05 and PASSED the requirements for a valid MOT with 3 comments.

This test (317489101369) was completed on the 05 November 2011 12:38:05 and PASSED the requirements for a valid MOT with 3 comments.

Recorded mileage: 18,066

Recorded mileage: 18,066


ADVISORY


MOT TEST: 09 November 2010 12:22:09 PASSED
MOT TEST: 09 November 2010 12:22:09 PASSED

This test (234853510339) was completed on the 09 November 2010 12:22:09 and PASSED the requirements for a valid MOT with 0 comments.

This test (234853510339) was completed on the 09 November 2010 12:22:09 and PASSED the requirements for a valid MOT with 0 comments.

Recorded mileage: 2,872

Recorded mileage: 2,872


MOT TEST: 27 June 2009 13:18:36 PASSED
MOT TEST: 27 June 2009 13:18:36 PASSED

This test (272608679407) was completed on the 27 June 2009 13:18:36 and PASSED the requirements for a valid MOT with 1 comments.

This test (272608679407) was completed on the 27 June 2009 13:18:36 and PASSED the requirements for a valid MOT with 1 comments.

Recorded mileage: 28,697

Recorded mileage: 28,697


ADVISORY


MOT TEST: 09 June 2008 15:54:12 PASSED
MOT TEST: 09 June 2008 15:54:12 PASSED

This test (453131768189) was completed on the 09 June 2008 15:54:12 and PASSED the requirements for a valid MOT with 3 comments.

This test (453131768189) was completed on the 09 June 2008 15:54:12 and PASSED the requirements for a valid MOT with 3 comments.

Recorded mileage: 28,578

Recorded mileage: 28,578


ADVISORY


MOT TEST: 19 June 2007 16:06:29 PASSED
MOT TEST: 19 June 2007 16:06:29 PASSED

This test (883410877121) was completed on the 19 June 2007 16:06:29 and PASSED the requirements for a valid MOT with 1 comments.

This test (883410877121) was completed on the 19 June 2007 16:06:29 and PASSED the requirements for a valid MOT with 1 comments.

Recorded mileage: 28,396

Recorded mileage: 28,396


ADVISORY


MOT TEST: 06 June 2006 10:46:21 PASSED
MOT TEST: 06 June 2006 10:46:21 PASSED

This test (433227156102) was completed on the 06 June 2006 10:46:21 and PASSED the requirements for a valid MOT with 0 comments.

This test (433227156102) was completed on the 06 June 2006 10:46:21 and PASSED the requirements for a valid MOT with 0 comments.

Recorded mileage: 28,224

Recorded mileage: 28,224


MOT TEST: 17 June 2005 10:39:17 PASSED
MOT TEST: 17 June 2005 10:39:17 PASSED

This test (761058465125) was completed on the 17 June 2005 10:39:17 and PASSED the requirements for a valid MOT with 0 comments.

This test (761058465125) was completed on the 17 June 2005 10:39:17 and PASSED the requirements for a valid MOT with 0 comments.

Recorded mileage: 27,295

Recorded mileage: 27,295