232 1WD


2321WD is registered to a Blue 1960, Morris Minor 1000 with a Petrol engine. It Passed its most recent MOT Test on the 27 September 2018

38 unique faults (43 Total) reported in its MOT History (19 Tests).

5 common/recurring faults, the most frequent (2 times) is: Nearside Front Suspension component mounting prescribed area is excessively corroded (2.4.A.3).

63% (12) MOT Pass Rate and a 37% (7) MOT Failure Rate.

70,893 recorded miles.

232 1WD


2321WD is registered to a Blue 1960, Morris Minor 1000 with a Petrol engine. It Passed its most recent MOT Test on the 27 September 2018

38 unique faults (43 Total) reported in its MOT History (19 Tests).

5 common/recurring faults, the most frequent (2 times) is: Nearside Front Suspension component mounting prescribed area is excessively corroded (2.4.A.3).

63% (12) MOT Pass Rate and a 37% (7) MOT Failure Rate.

70,893 recorded miles.

MOT PASS/Failure rate for 232 1WD

all MOT test results for 232 1WD represented as a percentage
MOT PASS/Failure rate for 232 1WD
all MOT test results for 232 1WD represented as a percentage

PERCENTAGE OF VEHICLE FAULTS WITH 232 1WD

ALL REPORTED FAULTS, DISPLAYED BY PERCENTAGE OF OCCURRENCE DURING ALL MOT TESTS
PERCENTAGE OF VEHICLE FAULTS WITH 232 1WD
ALL REPORTED FAULTS, DISPLAYED BY PERCENTAGE OF OCCURRENCE DURING ALL MOT TESTS
ADVISORY

FAIL

USER ENTERED

PASS WITH RECTIFICATION

232 1WD annual Faults by type

ALL REPORTED FAULTS, DISPLAYED over time and categorised by type
232 1WD annual Faults by type
ALL REPORTED FAULTS, DISPLAYED over time and categorised by type

RECURRING FAULTS WITH 232 1WD

FAULTS THAT HAVE OCCURED MORE THAN ONCE DURING 232 1WD's MOT HISTORY
RECURRING FAULTS WITH 232 1WD
FAULTS THAT HAVE OCCURED MORE THAN ONCE DURING 232 1WD's MOT HISTORY
Fault Fault Test Date Test Date/Time Reference MOT Test Reference
2 Nearside front suspension component mounting prescribed area is excessively corroded (2.4.a.3) Nearside front suspension component mounting prescribed area is excessively corroded (2.4.a.3) 19 September 2016 [13:11] 19/09/2016 06 October 2010 [13:08] 06/10/2010 893286900748 893286900748 872949770210 872949770210
2 Rear leaf spring has a slightly deteriorated shackle pin rubber bush not resulting in excessive movement both (2.4.b.2) Rear leaf spring has a slightly deteriorated shackle pin rubber bush not resulting in excessive movement both (2.4.b.2) 28 September 2015 [15:56] 28/09/2015 16 September 2015 [11:54] 16/09/2015 605151777221 605151777221 457377132632 457377132632
2 Nearside front suspension has slight play in a lower suspension ball joint trunnion (2.5.b.1a) Nearside front suspension has slight play in a lower suspension ball joint trunnion (2.5.b.1a) 28 September 2015 [15:56] 28/09/2015 16 September 2015 [11:54] 16/09/2015 605151777221 605151777221 457377132632 457377132632
2 Front brake hose slightly deteriorated both (3.6.b.4d) Front brake hose slightly deteriorated both (3.6.b.4d) 28 September 2015 [15:56] 28/09/2015 16 September 2015 [11:54] 16/09/2015 605151777221 605151777221 457377132632 457377132632
2 Rear brake hose slightly deteriorated (3.6.b.4d) Rear brake hose slightly deteriorated (3.6.b.4d) 28 September 2015 [15:56] 28/09/2015 16 September 2015 [11:54] 16/09/2015 605151777221 605151777221 457377132632 457377132632

ALL 232 1WD ADVISORIES [13]

ALL ADVISORIES, ORDERED by OCCURRENCE DURING 232 1WD's MOT HISTORY
ALL 232 1WD ADVISORIES [13]
ALL ADVISORIES, ORDERED by OCCURRENCE DURING 232 1WD's MOT HISTORY
Advisory Faults | source www.vehiclestats.co.uk
Fault Fault Test Date Test Date/Time Reference MOT Test Reference
2 Rear leaf spring has a slightly deteriorated shackle pin rubber bush not resulting in excessive movement both (2.4.b.2) Rear leaf spring has a slightly deteriorated shackle pin rubber bush not resulting in excessive movement both (2.4.b.2) 28 September 2015 [15:56] 28/09/2015 16 September 2015 [11:54] 16/09/2015 605151777221 605151777221 457377132632 457377132632
2 Nearside front suspension has slight play in a lower suspension ball joint trunnion (2.5.b.1a) Nearside front suspension has slight play in a lower suspension ball joint trunnion (2.5.b.1a) 28 September 2015 [15:56] 28/09/2015 16 September 2015 [11:54] 16/09/2015 605151777221 605151777221 457377132632 457377132632
2 Front brake hose slightly deteriorated both (3.6.b.4d) Front brake hose slightly deteriorated both (3.6.b.4d) 28 September 2015 [15:56] 28/09/2015 16 September 2015 [11:54] 16/09/2015 605151777221 605151777221 457377132632 457377132632
2 Rear brake hose slightly deteriorated (3.6.b.4d) Rear brake hose slightly deteriorated (3.6.b.4d) 28 September 2015 [15:56] 28/09/2015 16 September 2015 [11:54] 16/09/2015 605151777221 605151777221 457377132632 457377132632
1 Nearside front suspension arm pin or bush worn but not resulting in excessive movement (5.3.4 (a) (i)) Nearside front suspension arm pin or bush worn but not resulting in excessive movement (5.3.4 (a) (i)) 26 September 2018 [12:00] 26/09/2018 812525425644 812525425644
1 Offside front upper suspension arm pin or bush worn but not resulting in excessive movement (5.3.4 (a) (i)) Offside front upper suspension arm pin or bush worn but not resulting in excessive movement (5.3.4 (a) (i)) 26 September 2018 [12:00] 26/09/2018 812525425644 812525425644
1 Nearside front brake pipe slightly corroded to under bonnet area (3.6.b.2c) Nearside front brake pipe slightly corroded to under bonnet area (3.6.b.2c) 06 October 2017 [14:30] 06/10/2017 496778557246 496778557246
1 Nearside front suspension arm rubber bush deteriorated but not resulting in excessive movement torsion bar (2.4.g.2) Nearside front suspension arm rubber bush deteriorated but not resulting in excessive movement torsion bar (2.4.g.2) 28 September 2015 [15:56] 28/09/2015 605151777221 605151777221
1 Offside front upper front suspension has slight movement at a wishbone pin or bush (2.5.a.1c) Offside front upper front suspension has slight movement at a wishbone pin or bush (2.5.a.1c) 19 September 2013 [12:46] 19/09/2013 597772363236 597772363236

ALL 232 1WD Failure Faults [27]

ALL Failure faults, ORDERED by OCCURRENCE DURING 232 1WD's MOT HISTORY
ALL 232 1WD Failure Faults [27]
ALL Failure faults, ORDERED by OCCURRENCE DURING 232 1WD's MOT HISTORY
Fail Faults | source www.vehiclestats.co.uk
Fault Fault Test Date Test Date/Time Reference MOT Test Reference
2 Nearside front suspension component mounting prescribed area is excessively corroded (2.4.a.3) Nearside front suspension component mounting prescribed area is excessively corroded (2.4.a.3) 19 September 2016 [13:11] 19/09/2016 06 October 2010 [13:08] 06/10/2010 893286900748 893286900748 872949770210 872949770210
1 Registration plate lamp inoperative in the case of a single lamp or all lamps (4.7.1 (b) (ii)) Registration plate lamp inoperative in the case of a single lamp or all lamps (4.7.1 (b) (ii)) 26 September 2018 [12:00] 26/09/2018 812525425644 812525425644
1 Offside front anti-roll bar attachment bracket/mounting insecure d bush (5.3.3 (a) (i)) Offside front anti-roll bar attachment bracket/mounting insecure d bush (5.3.3 (a) (i)) 26 September 2018 [12:00] 26/09/2018 812525425644 812525425644
1 Rear brakes imbalanced across an axle (1.2.1 (b) (i)) Rear brakes imbalanced across an axle (1.2.1 (b) (i)) 26 September 2018 [12:00] 26/09/2018 812525425644 812525425644
1 Offside front suspension component mounting prescribed area is excessively corroded (2.4.a.3) Offside front suspension component mounting prescribed area is excessively corroded (2.4.a.3) 19 September 2016 [13:11] 19/09/2016 893286900748 893286900748
1 Parking brake: efficiency below requirements (3.7.b.7) Parking brake: efficiency below requirements (3.7.b.7) 16 September 2015 [11:54] 16/09/2015 457377132632 457377132632
1 Rear brakes imbalanced across an axle axle 2 (3.7.b.5b) Rear brakes imbalanced across an axle axle 2 (3.7.b.5b) 16 September 2015 [11:54] 16/09/2015 457377132632 457377132632
1 Windscreen washer provides insufficient washer liquid (8.2.3) Windscreen washer provides insufficient washer liquid (8.2.3) 16 September 2015 [11:54] 16/09/2015 457377132632 457377132632
1 Offside headlamp not working on dipped beam (1.7.5a) Offside headlamp not working on dipped beam (1.7.5a) 16 September 2015 [11:54] 16/09/2015 457377132632 457377132632
1 Offside headlamp not working on main beam (1.7.5a) Offside headlamp not working on main beam (1.7.5a) 16 September 2015 [11:54] 16/09/2015 457377132632 457377132632
1 Offside rear position lamp(s) not working (1.1.a.3b) Offside rear position lamp(s) not working (1.1.a.3b) 16 September 2015 [11:54] 16/09/2015 457377132632 457377132632
1 Nearside stop lamp not working (1.2.1b) Nearside stop lamp not working (1.2.1b) 16 September 2015 [11:54] 16/09/2015 457377132632 457377132632
1 Offside stop lamp not working (1.2.1b) Offside stop lamp not working (1.2.1b) 16 September 2015 [11:54] 16/09/2015 457377132632 457377132632
1 Nearside front suspension arm rubber bush deteriorated resulting in excessive movement torsion bar bushes (2.4.g.2) Nearside front suspension arm rubber bush deteriorated resulting in excessive movement torsion bar bushes (2.4.g.2) 16 September 2015 [11:54] 16/09/2015 457377132632 457377132632
1 Offside rear body or chassis has excessive corrosion, seriously affecting its strength within 30cm of the body mountings by rear leaf spring mounting. Chalk marked (6.1.b.2) Offside rear body or chassis has excessive corrosion, seriously affecting its strength within 30cm of the body mountings by rear leaf spring mounting. Chalk marked (6.1.b.2) 16 September 2015 [11:54] 16/09/2015 457377132632 457377132632
1 Offside track rod end ball joint dust cover excessively deteriorated so that it no longer prevents the ingress of dirt (2.2.c.1c) Offside track rod end ball joint dust cover excessively deteriorated so that it no longer prevents the ingress of dirt (2.2.c.1c) 16 September 2015 [11:54] 16/09/2015 457377132632 457377132632
1 Nearside rear parking brake recording little or no effort (3.7.b.6a) Nearside rear parking brake recording little or no effort (3.7.b.6a) 16 September 2015 [11:54] 16/09/2015 457377132632 457377132632
1 Nearside rear brake recording little or no effort (3.7.b.5a) Nearside rear brake recording little or no effort (3.7.b.5a) 16 September 2015 [11:54] 16/09/2015 457377132632 457377132632
1 Rear parking (secondary) brakes imbalanced (3.7.b.6b) Rear parking (secondary) brakes imbalanced (3.7.b.6b) 16 September 2015 [11:54] 16/09/2015 457377132632 457377132632
1 Steering wheel retaining device insecure (2.1.6) Steering wheel retaining device insecure (2.1.6) 11 September 2014 [09:44] 11/09/2014 308994454217 308994454217
1 Windscreen has a sticker or other obstruction encroaching into the swept area by more than 40mm outside zone 'a' (8.3.1e) Windscreen has a sticker or other obstruction encroaching into the swept area by more than 40mm outside zone 'a' (8.3.1e) 11 September 2014 [09:44] 11/09/2014 308994454217 308994454217
1 Offside headlamp aim too high (1.8) Offside headlamp aim too high (1.8) 11 September 2014 [09:44] 11/09/2014 308994454217 308994454217
1 Offside seat belt anchorage prescribed area is inadequately repaired (5.2.6) Offside seat belt anchorage prescribed area is inadequately repaired (5.2.6) 11 September 2014 [09:44] 11/09/2014 308994454217 308994454217
1 Brake pedal has insufficient reserve movement (3.3.a.5) Brake pedal has insufficient reserve movement (3.3.a.5) 11 September 2014 [09:44] 11/09/2014 308994454217 308994454217
1 Offside rear brake recording little or no effort (3.7.b.5a) Offside rear brake recording little or no effort (3.7.b.5a) 21 September 2011 [16:55] 21/09/2011 388214861494 388214861494
1 Rear exhaust system not adequately supported (7.1.1) Rear exhaust system not adequately supported (7.1.1) 06 October 2010 [13:08] 06/10/2010 872949770210 872949770210

ALL 232 1WD User Entered Faults [1]

ALL User Entered faults, ORDERED by OCCURRENCE DURING 232 1WD's MOT HISTORY
ALL 232 1WD User Entered Faults [1]
ALL User Entered faults, ORDERED by OCCURRENCE DURING 232 1WD's MOT HISTORY
Advisory Faults | source www.vehiclestats.co.uk
Fault Fault Test Date Test Date/Time Reference MOT Test Reference
1 Excess corrosion on near side jacking piont Excess corrosion on near side jacking piont 19 September 2013 [12:46] 19/09/2013 597772363236 597772363236

ALL 232 1WD Pass With Rectification Faults [2]

ALL Pass With Rectification faults, ORDERED by OCCURRENCE DURING 232 1WD's MOT HISTORY
ALL 232 1WD Pass With Rectification Faults [2]
ALL Pass With Rectification faults, ORDERED by OCCURRENCE DURING 232 1WD's MOT HISTORY
Pass With Rectification Faults | source www.vehiclestats.co.uk
Fault Fault Test Date Test Date/Time Reference MOT Test Reference
1 Nearside rear position lamp(s) not working (1.1.a.3b) Nearside rear position lamp(s) not working (1.1.a.3b) 14 September 2012 [12:38] 14/09/2012 355608052435 355608052435
1 Nearside headlamp not working on dipped beam (1.7.5a) Nearside headlamp not working on dipped beam (1.7.5a) 14 September 2012 [12:38] 14/09/2012 355608052435 355608052435

MOT TEST: 27 September 2018 08:50:52 PASSED
MOT TEST: 27 September 2018 08:50:52 PASSED

This test (276953386531) was completed on the 27 September 2018 08:50:52 and PASSED the requirements for a valid MOT with 0 comments.

This test (276953386531) was completed on the 27 September 2018 08:50:52 and PASSED the requirements for a valid MOT with 0 comments.

Recorded mileage: 70,893

Recorded mileage: 70,893


MOT TEST: 26 September 2018 12:00:39 FAILED
MOT TEST: 26 September 2018 12:00:39 FAILED

This test (812525425644) was completed on the 26 September 2018 12:00:39 and FAILED the requirements for a valid MOT with 5 comments.

This test (812525425644) was completed on the 26 September 2018 12:00:39 and FAILED the requirements for a valid MOT with 5 comments.

Recorded mileage: 70,890

Recorded mileage: 70,890


ADVISORY

FAIL


MOT TEST: 06 October 2017 14:30:15 PASSED
MOT TEST: 06 October 2017 14:30:15 PASSED

This test (496778557246) was completed on the 06 October 2017 14:30:15 and PASSED the requirements for a valid MOT with 1 comments.

This test (496778557246) was completed on the 06 October 2017 14:30:15 and PASSED the requirements for a valid MOT with 1 comments.

Recorded mileage: 65,362

Recorded mileage: 65,362


ADVISORY


MOT TEST: 22 September 2016 08:01:16 PASSED
MOT TEST: 22 September 2016 08:01:16 PASSED

This test (224874512119) was completed on the 22 September 2016 08:01:16 and PASSED the requirements for a valid MOT with 0 comments.

This test (224874512119) was completed on the 22 September 2016 08:01:16 and PASSED the requirements for a valid MOT with 0 comments.

Recorded mileage: 60,204

Recorded mileage: 60,204


MOT TEST: 19 September 2016 13:11:01 FAILED
MOT TEST: 19 September 2016 13:11:01 FAILED

This test (893286900748) was completed on the 19 September 2016 13:11:01 and FAILED the requirements for a valid MOT with 2 comments.

This test (893286900748) was completed on the 19 September 2016 13:11:01 and FAILED the requirements for a valid MOT with 2 comments.

Recorded mileage: 60,193

Recorded mileage: 60,193


FAIL


MOT TEST: 28 September 2015 15:56:18 PASSED
MOT TEST: 28 September 2015 15:56:18 PASSED

This test (605151777221) was completed on the 28 September 2015 15:56:18 and PASSED the requirements for a valid MOT with 5 comments.

This test (605151777221) was completed on the 28 September 2015 15:56:18 and PASSED the requirements for a valid MOT with 5 comments.

Recorded mileage: 57,699

Recorded mileage: 57,699


ADVISORY


MOT TEST: 16 September 2015 11:54:57 FAILED
MOT TEST: 16 September 2015 11:54:57 FAILED

This test (457377132632) was completed on the 16 September 2015 11:54:57 and FAILED the requirements for a valid MOT with 18 comments.

This test (457377132632) was completed on the 16 September 2015 11:54:57 and FAILED the requirements for a valid MOT with 18 comments.

Recorded mileage: 57,613

Recorded mileage: 57,613


ADVISORY

FAIL


MOT TEST: 11 September 2014 14:54:35 PASSED
MOT TEST: 11 September 2014 14:54:35 PASSED

This test (786424854235) was completed on the 11 September 2014 14:54:35 and PASSED the requirements for a valid MOT with 0 comments.

This test (786424854235) was completed on the 11 September 2014 14:54:35 and PASSED the requirements for a valid MOT with 0 comments.

Recorded mileage: 54,595

Recorded mileage: 54,595


MOT TEST: 11 September 2014 09:44:49 FAILED
MOT TEST: 11 September 2014 09:44:49 FAILED

This test (308994454217) was completed on the 11 September 2014 09:44:49 and FAILED the requirements for a valid MOT with 5 comments.

This test (308994454217) was completed on the 11 September 2014 09:44:49 and FAILED the requirements for a valid MOT with 5 comments.

Recorded mileage: 54,574

Recorded mileage: 54,574


FAIL


MOT TEST: 19 September 2013 12:46:53 PASSED
MOT TEST: 19 September 2013 12:46:53 PASSED

This test (597772363236) was completed on the 19 September 2013 12:46:53 and PASSED the requirements for a valid MOT with 2 comments.

This test (597772363236) was completed on the 19 September 2013 12:46:53 and PASSED the requirements for a valid MOT with 2 comments.

Recorded mileage: 51,004

Recorded mileage: 51,004


ADVISORY

USER ENTERED


MOT TEST: 14 September 2012 12:38:01 PASSED
MOT TEST: 14 September 2012 12:38:01 PASSED

This test (335638052221) was completed on the 14 September 2012 12:38:01 and PASSED the requirements for a valid MOT with 0 comments.

This test (335638052221) was completed on the 14 September 2012 12:38:01 and PASSED the requirements for a valid MOT with 0 comments.

Recorded mileage: 47,553

Recorded mileage: 47,553


MOT TEST: 14 September 2012 12:38:01 FAILED
MOT TEST: 14 September 2012 12:38:01 FAILED

This test (355608052435) was completed on the 14 September 2012 12:38:01 and FAILED the requirements for a valid MOT with 2 comments.

This test (355608052435) was completed on the 14 September 2012 12:38:01 and FAILED the requirements for a valid MOT with 2 comments.

Recorded mileage: 47,553

Recorded mileage: 47,553


PASS WITH RECTIFICATION


MOT TEST: 22 September 2011 15:51:21 PASSED
MOT TEST: 22 September 2011 15:51:21 PASSED

This test (939745261262) was completed on the 22 September 2011 15:51:21 and PASSED the requirements for a valid MOT with 0 comments.

This test (939745261262) was completed on the 22 September 2011 15:51:21 and PASSED the requirements for a valid MOT with 0 comments.

Recorded mileage: 44,708

Recorded mileage: 44,708


MOT TEST: 21 September 2011 16:55:43 FAILED
MOT TEST: 21 September 2011 16:55:43 FAILED

This test (388214861494) was completed on the 21 September 2011 16:55:43 and FAILED the requirements for a valid MOT with 1 comments.

This test (388214861494) was completed on the 21 September 2011 16:55:43 and FAILED the requirements for a valid MOT with 1 comments.

Recorded mileage: 44,670

Recorded mileage: 44,670


FAIL


MOT TEST: 06 October 2010 16:15:33 PASSED
MOT TEST: 06 October 2010 16:15:33 PASSED

This test (341449870220) was completed on the 06 October 2010 16:15:33 and PASSED the requirements for a valid MOT with 0 comments.

This test (341449870220) was completed on the 06 October 2010 16:15:33 and PASSED the requirements for a valid MOT with 0 comments.

Recorded mileage: 42,265

Recorded mileage: 42,265


MOT TEST: 06 October 2010 13:08:27 FAILED
MOT TEST: 06 October 2010 13:08:27 FAILED

This test (872949770210) was completed on the 06 October 2010 13:08:27 and FAILED the requirements for a valid MOT with 2 comments.

This test (872949770210) was completed on the 06 October 2010 13:08:27 and FAILED the requirements for a valid MOT with 2 comments.

Recorded mileage: 42,250

Recorded mileage: 42,250


FAIL


MOT TEST: 07 April 2010 11:46:50 PASSED
MOT TEST: 07 April 2010 11:46:50 PASSED

This test (180487590057) was completed on the 07 April 2010 11:46:50 and PASSED the requirements for a valid MOT with 0 comments.

This test (180487590057) was completed on the 07 April 2010 11:46:50 and PASSED the requirements for a valid MOT with 0 comments.

Recorded mileage: 42,155

Recorded mileage: 42,155


MOT TEST: 26 March 2009 16:16:06 PASSED
MOT TEST: 26 March 2009 16:16:06 PASSED

This test (421155389077) was completed on the 26 March 2009 16:16:06 and PASSED the requirements for a valid MOT with 0 comments.

This test (421155389077) was completed on the 26 March 2009 16:16:06 and PASSED the requirements for a valid MOT with 0 comments.

Recorded mileage: 41,237

Recorded mileage: 41,237


MOT TEST: 02 April 2008 11:53:42 PASSED
MOT TEST: 02 April 2008 11:53:42 PASSED

This test (713183998052) was completed on the 02 April 2008 11:53:42 and PASSED the requirements for a valid MOT with 0 comments.

This test (713183998052) was completed on the 02 April 2008 11:53:42 and PASSED the requirements for a valid MOT with 0 comments.

Recorded mileage: 40,539

Recorded mileage: 40,539