232 KOF


232KOF is registered to a White 1963, Morris Minor 1000 with a Petrol engine. It Failed its most recent MOT Test on the 10 July 2017

49 unique faults (57 Total) reported in its MOT History (8 Tests).

5 common/recurring faults, the most frequent (3 times) is: Parking brake: efficiency below requirements (3.7.B.7).

62% (5) MOT Pass Rate and a 38% (3) MOT Failure Rate.

99,723 recorded miles.

232 KOF


232KOF is registered to a White 1963, Morris Minor 1000 with a Petrol engine. It Failed its most recent MOT Test on the 10 July 2017

49 unique faults (57 Total) reported in its MOT History (8 Tests).

5 common/recurring faults, the most frequent (3 times) is: Parking brake: efficiency below requirements (3.7.B.7).

62% (5) MOT Pass Rate and a 38% (3) MOT Failure Rate.

99,723 recorded miles.

MOT PASS/Failure rate for 232 KOF

all MOT test results for 232 KOF represented as a percentage
MOT PASS/Failure rate for 232 KOF
all MOT test results for 232 KOF represented as a percentage

PERCENTAGE OF VEHICLE FAULTS WITH 232 KOF

ALL REPORTED FAULTS, DISPLAYED BY PERCENTAGE OF OCCURRENCE DURING ALL MOT TESTS
PERCENTAGE OF VEHICLE FAULTS WITH 232 KOF
ALL REPORTED FAULTS, DISPLAYED BY PERCENTAGE OF OCCURRENCE DURING ALL MOT TESTS
ADVISORY

FAIL

USER ENTERED

232 KOF annual Faults by type

ALL REPORTED FAULTS, DISPLAYED over time and categorised by type
232 KOF annual Faults by type
ALL REPORTED FAULTS, DISPLAYED over time and categorised by type

RECURRING FAULTS WITH 232 KOF

FAULTS THAT HAVE OCCURED MORE THAN ONCE DURING 232 KOF's MOT HISTORY
RECURRING FAULTS WITH 232 KOF
FAULTS THAT HAVE OCCURED MORE THAN ONCE DURING 232 KOF's MOT HISTORY
Fault Fault Test Date Test Date/Time Reference MOT Test Reference
3 Parking brake: efficiency below requirements (3.7.b.7) Parking brake: efficiency below requirements (3.7.b.7) 06 July 2017 [14:43] 06/07/2017 30 April 2012 [16:06] 30/04/2012 27 May 2010 [15:55] 27/05/2010 675757537431 675757537431 559201622185 559201622185 574257340135 574257340135
2 Offside front nail in tyre () Offside front nail in tyre () 10 July 2017 [15:06] 10/07/2017 06 July 2017 [14:43] 06/07/2017 638811055977 638811055977 675757537431 675757537431
2 All 4 tyres are showing signs of age All 4 tyres are showing signs of age 10 July 2017 [15:06] 10/07/2017 06 July 2017 [14:43] 06/07/2017 638811055977 638811055977 675757537431 675757537431
2 Nearside rear brake recording little or no effort (3.7.b.5a) Nearside rear brake recording little or no effort (3.7.b.5a) 06 July 2017 [14:43] 06/07/2017 30 April 2012 [16:06] 30/04/2012 675757537431 675757537431 559201622185 559201622185
2 Nearside rear parking brake recording little or no effort (3.7.b.6a) Nearside rear parking brake recording little or no effort (3.7.b.6a) 06 July 2017 [14:43] 06/07/2017 30 April 2012 [16:06] 30/04/2012 675757537431 675757537431 559201622185 559201622185

ALL 232 KOF ADVISORIES [21]

ALL ADVISORIES, ORDERED by OCCURRENCE DURING 232 KOF's MOT HISTORY
ALL 232 KOF ADVISORIES [21]
ALL ADVISORIES, ORDERED by OCCURRENCE DURING 232 KOF's MOT HISTORY
Advisory Faults | source www.vehiclestats.co.uk
Fault Fault Test Date Test Date/Time Reference MOT Test Reference
2 Offside front nail in tyre () Offside front nail in tyre () 10 July 2017 [15:06] 10/07/2017 06 July 2017 [14:43] 06/07/2017 638811055977 638811055977 675757537431 675757537431
2 All 4 tyres are showing signs of age All 4 tyres are showing signs of age 10 July 2017 [15:06] 10/07/2017 06 July 2017 [14:43] 06/07/2017 638811055977 638811055977 675757537431 675757537431
1 Nearside front brake is binding slightly Nearside front brake is binding slightly 06 July 2017 [14:43] 06/07/2017 675757537431 675757537431
1 Nearside rear brake is binding slightly Nearside rear brake is binding slightly 06 July 2017 [14:43] 06/07/2017 675757537431 675757537431
1 Previously welded panels, unable to view welds Previously welded panels, unable to view welds 09 July 2016 [09:00] 09/07/2016 408226107686 408226107686
1 Rear brake fluctuating, but not excessively (3.7.b.3) Rear brake fluctuating, but not excessively (3.7.b.3) 02 July 2014 [10:38] 02/07/2014 335713784191 335713784191
1 Offside front vehicle structure has slight corrosion (6.1.a.1) Offside front vehicle structure has slight corrosion (6.1.a.1) 02 July 2014 [10:38] 02/07/2014 335713784191 335713784191
1 Front brake fluctuating, but not excessively (3.7.b.3) Front brake fluctuating, but not excessively (3.7.b.3) 02 July 2014 [10:38] 02/07/2014 335713784191 335713784191
1 Front exhaust has a minor leak of exhaust gases (7.1.2) Front exhaust has a minor leak of exhaust gases (7.1.2) 30 April 2012 [16:06] 30/04/2012 559201622185 559201622185
1 Nearside front suspension component mounting prescribed area is corroded but not considered excessive (2.4.a.3) Nearside front suspension component mounting prescribed area is corroded but not considered excessive (2.4.a.3) 30 April 2012 [16:06] 30/04/2012 559201622185 559201622185
1 Offside front suspension component mounting prescribed area is corroded but not considered excessive (2.4.a.3) Offside front suspension component mounting prescribed area is corroded but not considered excessive (2.4.a.3) 30 April 2012 [16:06] 30/04/2012 559201622185 559201622185
1 Nearside front brake hose slightly deteriorated (3.6.b.4d) Nearside front brake hose slightly deteriorated (3.6.b.4d) 30 April 2012 [16:06] 30/04/2012 559201622185 559201622185
1 Nearside rear shock absorber has a slightly reduced damping effect (2.7.5) Nearside rear shock absorber has a slightly reduced damping effect (2.7.5) 30 April 2012 [16:06] 30/04/2012 559201622185 559201622185
1 Offside rear shock absorber has a slightly reduced damping effect (2.7.5) Offside rear shock absorber has a slightly reduced damping effect (2.7.5) 30 April 2012 [16:06] 30/04/2012 559201622185 559201622185
1 Nearside rear anti-roll bar linkage has slight play in a ball joint (2.4.g.2) Nearside rear anti-roll bar linkage has slight play in a ball joint (2.4.g.2) 30 April 2012 [16:06] 30/04/2012 559201622185 559201622185
1 Offside rear anti-roll bar linkage has slight play in a ball joint (2.4.g.2) Offside rear anti-roll bar linkage has slight play in a ball joint (2.4.g.2) 30 April 2012 [16:06] 30/04/2012 559201622185 559201622185
1 Nearside rear suspension component mounting prescribed area is corroded but not considered excessive (2.4.a.3) Nearside rear suspension component mounting prescribed area is corroded but not considered excessive (2.4.a.3) 30 April 2012 [16:06] 30/04/2012 559201622185 559201622185
1 Offside rear suspension component mounting prescribed area is corroded but not considered excessive (2.4.a.3) Offside rear suspension component mounting prescribed area is corroded but not considered excessive (2.4.a.3) 30 April 2012 [16:06] 30/04/2012 559201622185 559201622185
1 Exhaust emits blue smoke during acceleration (7.3.a.2c) Exhaust emits blue smoke during acceleration (7.3.a.2c) 30 April 2012 [16:06] 30/04/2012 559201622185 559201622185

ALL 232 KOF Failure Faults [32]

ALL Failure faults, ORDERED by OCCURRENCE DURING 232 KOF's MOT HISTORY
ALL 232 KOF Failure Faults [32]
ALL Failure faults, ORDERED by OCCURRENCE DURING 232 KOF's MOT HISTORY
Fail Faults | source www.vehiclestats.co.uk
Fault Fault Test Date Test Date/Time Reference MOT Test Reference
3 Parking brake: efficiency below requirements (3.7.b.7) Parking brake: efficiency below requirements (3.7.b.7) 06 July 2017 [14:43] 06/07/2017 30 April 2012 [16:06] 30/04/2012 27 May 2010 [15:55] 27/05/2010 675757537431 675757537431 559201622185 559201622185 574257340135 574257340135
2 Nearside rear brake recording little or no effort (3.7.b.5a) Nearside rear brake recording little or no effort (3.7.b.5a) 06 July 2017 [14:43] 06/07/2017 30 April 2012 [16:06] 30/04/2012 675757537431 675757537431 559201622185 559201622185
2 Nearside rear parking brake recording little or no effort (3.7.b.6a) Nearside rear parking brake recording little or no effort (3.7.b.6a) 06 July 2017 [14:43] 06/07/2017 30 April 2012 [16:06] 30/04/2012 675757537431 675757537431 559201622185 559201622185
1 Battery insecure (1.9.1) Battery insecure (1.9.1) 06 July 2017 [14:43] 06/07/2017 675757537431 675757537431
1 Rear brakes imbalanced across an axle axle 2 (3.7.b.5b) Rear brakes imbalanced across an axle axle 2 (3.7.b.5b) 06 July 2017 [14:43] 06/07/2017 675757537431 675757537431
1 Offside drivers door cannot be opened from outside the vehicle (6.2.b.1b) Offside drivers door cannot be opened from outside the vehicle (6.2.b.1b) 30 April 2012 [16:06] 30/04/2012 559201622185 559201622185
1 Horn not working (1.6.2a) Horn not working (1.6.2a) 30 April 2012 [16:06] 30/04/2012 559201622185 559201622185
1 Rear registration plate lamp not working (1.1.c.1d) Rear registration plate lamp not working (1.1.c.1d) 30 April 2012 [16:06] 30/04/2012 559201622185 559201622185
1 Windscreen washer provides insufficient washer liquid (8.2.3) Windscreen washer provides insufficient washer liquid (8.2.3) 30 April 2012 [16:06] 30/04/2012 559201622185 559201622185
1 Nearside rear suspension component mounting prescribed area is inadequately repaired (2.4.a.3) Nearside rear suspension component mounting prescribed area is inadequately repaired (2.4.a.3) 30 April 2012 [16:06] 30/04/2012 559201622185 559201622185
1 Nearside front sub-frame inappropriately repaired (2.4.a.2) Nearside front sub-frame inappropriately repaired (2.4.a.2) 30 April 2012 [16:06] 30/04/2012 559201622185 559201622185
1 Offside front sub-frame inappropriately repaired (2.4.a.2) Offside front sub-frame inappropriately repaired (2.4.a.2) 30 April 2012 [16:06] 30/04/2012 559201622185 559201622185
1 Rear exhaust system not adequately supported (7.1.1) Rear exhaust system not adequately supported (7.1.1) 30 April 2012 [16:06] 30/04/2012 559201622185 559201622185
1 Offside rear tyre has a lump, caused by separation or partial failure of its structure (4.1.d.1b) Offside rear tyre has a lump, caused by separation or partial failure of its structure (4.1.d.1b) 30 April 2012 [16:06] 30/04/2012 559201622185 559201622185
1 Nearside rear brake binding (3.7.b.1) Nearside rear brake binding (3.7.b.1) 30 April 2012 [16:06] 30/04/2012 559201622185 559201622185
1 Service brake: efficiency below requirements (3.7.b.7) Service brake: efficiency below requirements (3.7.b.7) 27 May 2010 [15:55] 27/05/2010 574257340135 574257340135
1 Headlamp switch faulty (1.7.1) Headlamp switch faulty (1.7.1) 27 May 2010 [15:55] 27/05/2010 574257340135 574257340135
1 Front windscreen wiper not operating automatically when switched on (8.2.1b) Front windscreen wiper not operating automatically when switched on (8.2.1b) 27 May 2010 [15:55] 27/05/2010 574257340135 574257340135
1 Front windscreen washer provides insufficient washer liquid (8.2.3) Front windscreen washer provides insufficient washer liquid (8.2.3) 27 May 2010 [15:55] 27/05/2010 574257340135 574257340135
1 Offside front drivers door cannot be opened from inside the vehicle (6.2.b.1b) Offside front drivers door cannot be opened from inside the vehicle (6.2.b.1b) 27 May 2010 [15:55] 27/05/2010 574257340135 574257340135
1 Offside front drivers door cannot be opened from outside the vehicle (6.2.b.1b) Offside front drivers door cannot be opened from outside the vehicle (6.2.b.1b) 27 May 2010 [15:55] 27/05/2010 574257340135 574257340135
1 Nearside rear rear brake binding (3.7.b.1) Nearside rear rear brake binding (3.7.b.1) 27 May 2010 [15:55] 27/05/2010 574257340135 574257340135
1 Nearside rear suspension spring mounting prescribed area is excessively corroded (2.4.a.3) Nearside rear suspension spring mounting prescribed area is excessively corroded (2.4.a.3) 27 May 2010 [15:55] 27/05/2010 574257340135 574257340135
1 Offside rear suspension spring mounting prescribed area is excessively corroded (2.4.a.3) Offside rear suspension spring mounting prescribed area is excessively corroded (2.4.a.3) 27 May 2010 [15:55] 27/05/2010 574257340135 574257340135
1 Nearside front suspension spring mounting prescribed area is excessively corroded (2.4.a.3) Nearside front suspension spring mounting prescribed area is excessively corroded (2.4.a.3) 27 May 2010 [15:55] 27/05/2010 574257340135 574257340135
1 Offside front suspension spring mounting prescribed area is excessively corroded (2.4.a.3) Offside front suspension spring mounting prescribed area is excessively corroded (2.4.a.3) 27 May 2010 [15:55] 27/05/2010 574257340135 574257340135

ALL 232 KOF User Entered Faults [4]

ALL User Entered faults, ORDERED by OCCURRENCE DURING 232 KOF's MOT HISTORY
ALL 232 KOF User Entered Faults [4]
ALL User Entered faults, ORDERED by OCCURRENCE DURING 232 KOF's MOT HISTORY
User Entered Faults | source www.vehiclestats.co.uk
Fault Fault Test Date Test Date/Time Reference MOT Test Reference
1 Front and rear brakes slightly fluctuating Front and rear brakes slightly fluctuating 04 June 2015 [17:26] 04/06/2015 596125355191 596125355191
1 Both front inner door step sill corrosion Both front inner door step sill corrosion 30 April 2012 [16:06] 30/04/2012 559201622185 559201622185
1 Offside door & front wing have corrosion Offside door & front wing have corrosion 30 April 2012 [16:06] 30/04/2012 559201622185 559201622185
1 Vehicle is very rusty and poor condsion inside and out Vehicle is very rusty and poor condsion inside and out 27 May 2010 [15:55] 27/05/2010 574257340135 574257340135

MOT TEST: 10 July 2017 15:06:15 PASSED
MOT TEST: 10 July 2017 15:06:15 PASSED

This test (638811055977) was completed on the 10 July 2017 15:06:15 and PASSED the requirements for a valid MOT with 2 comments.

This test (638811055977) was completed on the 10 July 2017 15:06:15 and PASSED the requirements for a valid MOT with 2 comments.

Recorded mileage: 99,723

Recorded mileage: 99,723


ADVISORY


MOT TEST: 06 July 2017 14:43:20 FAILED
MOT TEST: 06 July 2017 14:43:20 FAILED

This test (675757537431) was completed on the 06 July 2017 14:43:20 and FAILED the requirements for a valid MOT with 9 comments.

This test (675757537431) was completed on the 06 July 2017 14:43:20 and FAILED the requirements for a valid MOT with 9 comments.

Recorded mileage: 99,723

Recorded mileage: 99,723


ADVISORY

FAIL


MOT TEST: 09 July 2016 09:00:35 PASSED
MOT TEST: 09 July 2016 09:00:35 PASSED

This test (408226107686) was completed on the 09 July 2016 09:00:35 and PASSED the requirements for a valid MOT with 1 comments.

This test (408226107686) was completed on the 09 July 2016 09:00:35 and PASSED the requirements for a valid MOT with 1 comments.

Recorded mileage: 99,711

Recorded mileage: 99,711


ADVISORY


MOT TEST: 04 June 2015 17:26:22 PASSED
MOT TEST: 04 June 2015 17:26:22 PASSED

This test (596125355191) was completed on the 04 June 2015 17:26:22 and PASSED the requirements for a valid MOT with 1 comments.

This test (596125355191) was completed on the 04 June 2015 17:26:22 and PASSED the requirements for a valid MOT with 1 comments.

Recorded mileage: 99,655

Recorded mileage: 99,655


USER ENTERED


MOT TEST: 02 July 2014 10:38:17 PASSED
MOT TEST: 02 July 2014 10:38:17 PASSED

This test (335713784191) was completed on the 02 July 2014 10:38:17 and PASSED the requirements for a valid MOT with 3 comments.

This test (335713784191) was completed on the 02 July 2014 10:38:17 and PASSED the requirements for a valid MOT with 3 comments.

Recorded mileage: 99,632

Recorded mileage: 99,632


ADVISORY


MOT TEST: 30 April 2012 16:06:45 FAILED
MOT TEST: 30 April 2012 16:06:45 FAILED

This test (559201622185) was completed on the 30 April 2012 16:06:45 and FAILED the requirements for a valid MOT with 28 comments.

This test (559201622185) was completed on the 30 April 2012 16:06:45 and FAILED the requirements for a valid MOT with 28 comments.

Recorded mileage: 99,607

Recorded mileage: 99,607


ADVISORY

FAIL

USER ENTERED


MOT TEST: 11 June 2010 18:51:50 PASSED
MOT TEST: 11 June 2010 18:51:50 PASSED

This test (123132760137) was completed on the 11 June 2010 18:51:50 and PASSED the requirements for a valid MOT with 0 comments.

This test (123132760137) was completed on the 11 June 2010 18:51:50 and PASSED the requirements for a valid MOT with 0 comments.

Recorded mileage: 99,591

Recorded mileage: 99,591


MOT TEST: 27 May 2010 15:55:34 FAILED
MOT TEST: 27 May 2010 15:55:34 FAILED

This test (574257340135) was completed on the 27 May 2010 15:55:34 and FAILED the requirements for a valid MOT with 13 comments.

This test (574257340135) was completed on the 27 May 2010 15:55:34 and FAILED the requirements for a valid MOT with 13 comments.

Recorded mileage: 99,591

Recorded mileage: 99,591


FAIL

USER ENTERED