234 XUJ


234XUJ is registered to a Red 1962, Morris Minor with a Petrol engine. It Failed its most recent MOT Test on the 24 July 2017

37 unique faults (43 Total) reported in its MOT History (9 Tests).

4 common/recurring faults, the most frequent (2 times) is: Registration plate lamp not working (1.1.C.1d).

56% (5) MOT Pass Rate and a 44% (4) MOT Failure Rate.

98,798 recorded miles.

234 XUJ


234XUJ is registered to a Red 1962, Morris Minor with a Petrol engine. It Failed its most recent MOT Test on the 24 July 2017

37 unique faults (43 Total) reported in its MOT History (9 Tests).

4 common/recurring faults, the most frequent (2 times) is: Registration plate lamp not working (1.1.C.1d).

56% (5) MOT Pass Rate and a 44% (4) MOT Failure Rate.

98,798 recorded miles.

MOT PASS/Failure rate for 234 XUJ

all MOT test results for 234 XUJ represented as a percentage
MOT PASS/Failure rate for 234 XUJ
all MOT test results for 234 XUJ represented as a percentage

PERCENTAGE OF VEHICLE FAULTS WITH 234 XUJ

ALL REPORTED FAULTS, DISPLAYED BY PERCENTAGE OF OCCURRENCE DURING ALL MOT TESTS
PERCENTAGE OF VEHICLE FAULTS WITH 234 XUJ
ALL REPORTED FAULTS, DISPLAYED BY PERCENTAGE OF OCCURRENCE DURING ALL MOT TESTS
ADVISORY

FAIL

234 XUJ annual Faults by type

ALL REPORTED FAULTS, DISPLAYED over time and categorised by type
234 XUJ annual Faults by type
ALL REPORTED FAULTS, DISPLAYED over time and categorised by type

RECURRING FAULTS WITH 234 XUJ

FAULTS THAT HAVE OCCURED MORE THAN ONCE DURING 234 XUJ's MOT HISTORY
RECURRING FAULTS WITH 234 XUJ
FAULTS THAT HAVE OCCURED MORE THAN ONCE DURING 234 XUJ's MOT HISTORY
Fault Fault Test Date Test Date/Time Reference MOT Test Reference
2 Registration plate lamp not working (1.1.c.1d) Registration plate lamp not working (1.1.c.1d) 11 August 2011 [14:24] 11/08/2011 23 July 2010 [15:04] 23/07/2010 685963621224 685963621224 202014000278 202014000278
2 Offside headlamp not working on dipped beam (1.7.5a) Offside headlamp not working on dipped beam (1.7.5a) 11 August 2011 [14:24] 11/08/2011 02 June 2006 [12:32] 02/06/2006 685963621224 685963621224 334053456137 334053456137
2 Brakes imbalanced across an axle (3.7.b.5b) Brakes imbalanced across an axle (3.7.b.5b) 11 August 2011 [14:24] 11/08/2011 11 July 2006 [17:00] 11/07/2006 685963621224 685963621224 203902696447 203902696447
2 Nearside rear suspension spring mounting prescribed area is excessively corroded (2.4.a.3) Nearside rear suspension spring mounting prescribed area is excessively corroded (2.4.a.3) 23 July 2010 [15:04] 23/07/2010 02 June 2006 [12:32] 02/06/2006 202014000278 202014000278 334053456137 334053456137

ALL 234 XUJ ADVISORIES [3]

ALL ADVISORIES, ORDERED by OCCURRENCE DURING 234 XUJ's MOT HISTORY
ALL 234 XUJ ADVISORIES [3]
ALL ADVISORIES, ORDERED by OCCURRENCE DURING 234 XUJ's MOT HISTORY
Advisory Faults | source www.vehiclestats.co.uk
Fault Fault Test Date Test Date/Time Reference MOT Test Reference
1 Body has slight corrosion (6.1.b.2) Body has slight corrosion (6.1.b.2) 24 July 2017 [15:34] 24/07/2017 690079907663 690079907663
1 Nearside rear anti-roll bar linkage has slight play in a ball joint (2.4.g.2) Nearside rear anti-roll bar linkage has slight play in a ball joint (2.4.g.2) 23 July 2010 [15:04] 23/07/2010 202014000278 202014000278
1 Nearside vehicle structure has slight corrosion (6.1.b.2) Nearside vehicle structure has slight corrosion (6.1.b.2) 13 July 2006 [14:57] 13/07/2006 182174496158 182174496158

ALL 234 XUJ Failure Faults [40]

ALL Failure faults, ORDERED by OCCURRENCE DURING 234 XUJ's MOT HISTORY
ALL 234 XUJ Failure Faults [40]
ALL Failure faults, ORDERED by OCCURRENCE DURING 234 XUJ's MOT HISTORY
Fail Faults | source www.vehiclestats.co.uk
Fault Fault Test Date Test Date/Time Reference MOT Test Reference
2 Registration plate lamp not working (1.1.c.1d) Registration plate lamp not working (1.1.c.1d) 11 August 2011 [14:24] 11/08/2011 23 July 2010 [15:04] 23/07/2010 685963621224 685963621224 202014000278 202014000278
2 Offside headlamp not working on dipped beam (1.7.5a) Offside headlamp not working on dipped beam (1.7.5a) 11 August 2011 [14:24] 11/08/2011 02 June 2006 [12:32] 02/06/2006 685963621224 685963621224 334053456137 334053456137
2 Brakes imbalanced across an axle (3.7.b.5b) Brakes imbalanced across an axle (3.7.b.5b) 11 August 2011 [14:24] 11/08/2011 11 July 2006 [17:00] 11/07/2006 685963621224 685963621224 203902696447 203902696447
2 Nearside rear suspension spring mounting prescribed area is excessively corroded (2.4.a.3) Nearside rear suspension spring mounting prescribed area is excessively corroded (2.4.a.3) 23 July 2010 [15:04] 23/07/2010 02 June 2006 [12:32] 02/06/2006 202014000278 202014000278 334053456137 334053456137
1 Nearside headlamp not working on dipped beam (1.7.5a) Nearside headlamp not working on dipped beam (1.7.5a) 11 August 2011 [14:24] 11/08/2011 685963621224 685963621224
1 Nearside headlamp not working on main beam (1.7.5a) Nearside headlamp not working on main beam (1.7.5a) 11 August 2011 [14:24] 11/08/2011 685963621224 685963621224
1 Offside headlamp not working on main beam (1.7.5a) Offside headlamp not working on main beam (1.7.5a) 11 August 2011 [14:24] 11/08/2011 685963621224 685963621224
1 Nearside headlamp aim not tested (1.8.a.1c) Nearside headlamp aim not tested (1.8.a.1c) 11 August 2011 [14:24] 11/08/2011 685963621224 685963621224
1 Offside headlamp aim not tested (1.8.a.1c) Offside headlamp aim not tested (1.8.a.1c) 11 August 2011 [14:24] 11/08/2011 685963621224 685963621224
1 Fuel pipe union leaking (7.2.3) Fuel pipe union leaking (7.2.3) 11 August 2011 [14:24] 11/08/2011 685963621224 685963621224
1 Front headlamp does not operate immediately when selected on main beam (1.7.4a) Front headlamp does not operate immediately when selected on main beam (1.7.4a) 23 July 2010 [15:04] 23/07/2010 202014000278 202014000278
1 Front headlamp does not operate immediately when selected on dipped beam (1.7.4a) Front headlamp does not operate immediately when selected on dipped beam (1.7.4a) 23 July 2010 [15:04] 23/07/2010 202014000278 202014000278
1 Nearside front front suspension has excessive play in a upper suspension ball joint (2.5.b.1a) Nearside front front suspension has excessive play in a upper suspension ball joint (2.5.b.1a) 23 July 2010 [15:04] 23/07/2010 202014000278 202014000278
1 Nearside front suspension has excessive play in a lower suspension ball joint (2.5.b.1a) Nearside front suspension has excessive play in a lower suspension ball joint (2.5.b.1a) 23 July 2010 [15:04] 23/07/2010 202014000278 202014000278
1 Offside rear anti-roll bar linkage has excessive play in a ball joint (2.4.g.2) Offside rear anti-roll bar linkage has excessive play in a ball joint (2.4.g.2) 23 July 2010 [15:04] 23/07/2010 202014000278 202014000278
1 Nearside rear leaf spring has excessive wear in a shackle pin and/or bush (2.4.b.2) Nearside rear leaf spring has excessive wear in a shackle pin and/or bush (2.4.b.2) 23 July 2010 [15:04] 23/07/2010 202014000278 202014000278
1 Offside rear leaf spring has excessive wear in a shackle pin and/or bush (2.4.b.2) Offside rear leaf spring has excessive wear in a shackle pin and/or bush (2.4.b.2) 23 July 2010 [15:04] 23/07/2010 202014000278 202014000278
1 Nearside parking brake mechanism/associated mounting prescribed area is excessively corroded (3.1.9) Nearside parking brake mechanism/associated mounting prescribed area is excessively corroded (3.1.9) 23 July 2010 [15:04] 23/07/2010 202014000278 202014000278
1 Nearside front brake pipe inadequately clipped (3.6.b.1) Nearside front brake pipe inadequately clipped (3.6.b.1) 23 July 2010 [15:04] 23/07/2010 202014000278 202014000278
1 Front brake pipe inadequately clipped (3.6.b.1) Front brake pipe inadequately clipped (3.6.b.1) 23 July 2010 [15:04] 23/07/2010 202014000278 202014000278
1 Drivers seat insecure (6.2.a.1) Drivers seat insecure (6.2.a.1) 23 July 2010 [15:04] 23/07/2010 202014000278 202014000278
1 Nearside front passengers seat insecure (6.2.a.1) Nearside front passengers seat insecure (6.2.a.1) 23 July 2010 [15:04] 23/07/2010 202014000278 202014000278
1 Rear passengers seat insecure (6.2.a.1) Rear passengers seat insecure (6.2.a.1) 23 July 2010 [15:04] 23/07/2010 202014000278 202014000278
1 Nearside front position lamp(s) not working (1.1.a.3b) Nearside front position lamp(s) not working (1.1.a.3b) 11 July 2006 [17:00] 11/07/2006 203902696447 203902696447
1 Offside headlamp aim too low when the centre of the headlamp is below 850mm from the ground (1.6.b2) Offside headlamp aim too low when the centre of the headlamp is below 850mm from the ground (1.6.b2) 11 July 2006 [17:00] 11/07/2006 203902696447 203902696447
1 Offside direction indicator not working (1.4.a.2c) Offside direction indicator not working (1.4.a.2c) 11 July 2006 [17:00] 11/07/2006 203902696447 203902696447
1 Nearside front seat belt anchorage prescribed area is excessively corroded (5.2.6) Nearside front seat belt anchorage prescribed area is excessively corroded (5.2.6) 11 July 2006 [17:00] 11/07/2006 203902696447 203902696447
1 Nearside rear suspension component mounting prescribed area is inadequately repaired (2.4.a.3) Nearside rear suspension component mounting prescribed area is inadequately repaired (2.4.a.3) 11 July 2006 [17:00] 11/07/2006 203902696447 203902696447
1 Offside rear suspension component mounting prescribed area is inadequately repaired (2.4.a.3) Offside rear suspension component mounting prescribed area is inadequately repaired (2.4.a.3) 11 July 2006 [17:00] 11/07/2006 203902696447 203902696447
1 Nearside front suspension component mounting prescribed area is inadequately repaired (2.4.a.3) Nearside front suspension component mounting prescribed area is inadequately repaired (2.4.a.3) 11 July 2006 [17:00] 11/07/2006 203902696447 203902696447
1 Nearside suspension component mounting prescribed area is excessively corroded (2.4.a.3) Nearside suspension component mounting prescribed area is excessively corroded (2.4.a.3) 02 June 2006 [12:32] 02/06/2006 334053456137 334053456137
1 Offside rear suspension spring mounting prescribed area is excessively corroded (2.4.a.3) Offside rear suspension spring mounting prescribed area is excessively corroded (2.4.a.3) 02 June 2006 [12:32] 02/06/2006 334053456137 334053456137
1 Nearside rear suspension component mounting prescribed area is excessively corroded (2.4.a.3) Nearside rear suspension component mounting prescribed area is excessively corroded (2.4.a.3) 02 June 2006 [12:32] 02/06/2006 334053456137 334053456137
1 Offside rear suspension component mounting prescribed area is excessively corroded (2.4.a.3) Offside rear suspension component mounting prescribed area is excessively corroded (2.4.a.3) 02 June 2006 [12:32] 02/06/2006 334053456137 334053456137

MOT TEST: 24 July 2017 15:34:33 PASSED
MOT TEST: 24 July 2017 15:34:33 PASSED

This test (690079907663) was completed on the 24 July 2017 15:34:33 and PASSED the requirements for a valid MOT with 1 comments.

This test (690079907663) was completed on the 24 July 2017 15:34:33 and PASSED the requirements for a valid MOT with 1 comments.

Recorded mileage: 16,663

Recorded mileage: 16,663


ADVISORY


MOT TEST: 24 April 2012 17:55:41 PASSED
MOT TEST: 24 April 2012 17:55:41 PASSED

This test (706565712146) was completed on the 24 April 2012 17:55:41 and PASSED the requirements for a valid MOT with 0 comments.

This test (706565712146) was completed on the 24 April 2012 17:55:41 and PASSED the requirements for a valid MOT with 0 comments.

Recorded mileage: 399

Recorded mileage: 399


MOT TEST: 11 August 2011 15:42:24 PASSED
MOT TEST: 11 August 2011 15:42:24 PASSED

This test (366393821232) was completed on the 11 August 2011 15:42:24 and PASSED the requirements for a valid MOT with 0 comments.

This test (366393821232) was completed on the 11 August 2011 15:42:24 and PASSED the requirements for a valid MOT with 0 comments.

Recorded mileage: 98,798

Recorded mileage: 98,798


MOT TEST: 11 August 2011 14:24:09 FAILED
MOT TEST: 11 August 2011 14:24:09 FAILED

This test (685963621224) was completed on the 11 August 2011 14:24:09 and FAILED the requirements for a valid MOT with 9 comments.

This test (685963621224) was completed on the 11 August 2011 14:24:09 and FAILED the requirements for a valid MOT with 9 comments.

Recorded mileage: 98,798

Recorded mileage: 98,798


FAIL


MOT TEST: 30 July 2010 14:53:38 PASSED
MOT TEST: 30 July 2010 14:53:38 PASSED

This test (284981510273) was completed on the 30 July 2010 14:53:38 and PASSED the requirements for a valid MOT with 0 comments.

This test (284981510273) was completed on the 30 July 2010 14:53:38 and PASSED the requirements for a valid MOT with 0 comments.

Recorded mileage: 96,299

Recorded mileage: 96,299


MOT TEST: 23 July 2010 15:04:31 FAILED
MOT TEST: 23 July 2010 15:04:31 FAILED

This test (202014000278) was completed on the 23 July 2010 15:04:31 and FAILED the requirements for a valid MOT with 16 comments.

This test (202014000278) was completed on the 23 July 2010 15:04:31 and FAILED the requirements for a valid MOT with 16 comments.

Recorded mileage: 96,299

Recorded mileage: 96,299


ADVISORY

FAIL


MOT TEST: 13 July 2006 14:57:33 PASSED
MOT TEST: 13 July 2006 14:57:33 PASSED

This test (182174496158) was completed on the 13 July 2006 14:57:33 and PASSED the requirements for a valid MOT with 1 comments.

This test (182174496158) was completed on the 13 July 2006 14:57:33 and PASSED the requirements for a valid MOT with 1 comments.

Recorded mileage: 88,485

Recorded mileage: 88,485


ADVISORY


MOT TEST: 11 July 2006 17:00:08 FAILED
MOT TEST: 11 July 2006 17:00:08 FAILED

This test (203902696447) was completed on the 11 July 2006 17:00:08 and FAILED the requirements for a valid MOT with 8 comments.

This test (203902696447) was completed on the 11 July 2006 17:00:08 and FAILED the requirements for a valid MOT with 8 comments.

Recorded mileage: 88,445

Recorded mileage: 88,445


FAIL


MOT TEST: 02 June 2006 12:32:58 FAILED
MOT TEST: 02 June 2006 12:32:58 FAILED

This test (334053456137) was completed on the 02 June 2006 12:32:58 and FAILED the requirements for a valid MOT with 8 comments.

This test (334053456137) was completed on the 02 June 2006 12:32:58 and FAILED the requirements for a valid MOT with 8 comments.

Recorded mileage: 88,381

Recorded mileage: 88,381


FAIL