2362H


2362H is registered to a Black 1953, Morris Minor with a Petrol engine. It Failed its most recent MOT Test on the 07 June 2012

4 unique faults (4 Total) reported in its MOT History (8 Tests).

0 common/recurring faults.

75% (6) MOT Pass Rate and a 25% (2) MOT Failure Rate.

50,716 recorded miles.

2362H


2362H is registered to a Black 1953, Morris Minor with a Petrol engine. It Failed its most recent MOT Test on the 07 June 2012

4 unique faults (4 Total) reported in its MOT History (8 Tests).

0 common/recurring faults.

75% (6) MOT Pass Rate and a 25% (2) MOT Failure Rate.

50,716 recorded miles.

MOT PASS/Failure rate for 2362H

all MOT test results for 2362H represented as a percentage
MOT PASS/Failure rate for 2362H
all MOT test results for 2362H represented as a percentage

PERCENTAGE OF VEHICLE FAULTS WITH 2362H

ALL REPORTED FAULTS, DISPLAYED BY PERCENTAGE OF OCCURRENCE DURING ALL MOT TESTS
PERCENTAGE OF VEHICLE FAULTS WITH 2362H
ALL REPORTED FAULTS, DISPLAYED BY PERCENTAGE OF OCCURRENCE DURING ALL MOT TESTS
FAIL

2362H annual Faults by type

ALL REPORTED FAULTS, DISPLAYED over time and categorised by type
2362H annual Faults by type
ALL REPORTED FAULTS, DISPLAYED over time and categorised by type

ALL 2362H Failure Faults [4]

ALL Failure faults, ORDERED by OCCURRENCE DURING 2362H's MOT HISTORY
ALL 2362H Failure Faults [4]
ALL Failure faults, ORDERED by OCCURRENCE DURING 2362H's MOT HISTORY
Fail Faults | source www.vehiclestats.co.uk
Fault Fault Test Date Test Date/Time Reference MOT Test Reference
1 Nearside front suspension has excessive play in a upper suspension ball joint (2.5.b.1a) Nearside front suspension has excessive play in a upper suspension ball joint (2.5.b.1a) 20 July 2007 [09:22] 20/07/2007 471931907236 471931907236
1 Nearside rear suspension spring mounting prescribed area is excessively corroded (2.4.a.3) Nearside rear suspension spring mounting prescribed area is excessively corroded (2.4.a.3) 20 July 2007 [09:22] 20/07/2007 471931907236 471931907236
1 Nearside rear tyre has a tear, caused by separation or partial failure of its structure (4.1.d.1b) Nearside rear tyre has a tear, caused by separation or partial failure of its structure (4.1.d.1b) 16 February 2006 [09:10] 16/02/2006 764507846081 764507846081
1 Brakes imbalanced across an axle (3.7.b.5b) Brakes imbalanced across an axle (3.7.b.5b) 16 February 2006 [09:10] 16/02/2006 764507846081 764507846081

MOT TEST: 07 June 2012 08:54:50 PASSED
MOT TEST: 07 June 2012 08:54:50 PASSED

This test (935259052154) was completed on the 07 June 2012 08:54:50 and PASSED the requirements for a valid MOT with 0 comments.

This test (935259052154) was completed on the 07 June 2012 08:54:50 and PASSED the requirements for a valid MOT with 0 comments.

Recorded mileage: 50,716

Recorded mileage: 50,716


MOT TEST: 16 June 2011 10:11:28 PASSED
MOT TEST: 16 June 2011 10:11:28 PASSED

This test (189737861136) was completed on the 16 June 2011 10:11:28 and PASSED the requirements for a valid MOT with 0 comments.

This test (189737861136) was completed on the 16 June 2011 10:11:28 and PASSED the requirements for a valid MOT with 0 comments.

Recorded mileage: 50,237

Recorded mileage: 50,237


MOT TEST: 19 September 2008 09:04:42 PASSED
MOT TEST: 19 September 2008 09:04:42 PASSED

This test (614823368234) was completed on the 19 September 2008 09:04:42 and PASSED the requirements for a valid MOT with 0 comments.

This test (614823368234) was completed on the 19 September 2008 09:04:42 and PASSED the requirements for a valid MOT with 0 comments.

Recorded mileage: 47,955

Recorded mileage: 47,955


MOT TEST: 29 August 2007 12:34:14 PASSED
MOT TEST: 29 August 2007 12:34:14 PASSED

This test (364611247426) was completed on the 29 August 2007 12:34:14 and PASSED the requirements for a valid MOT with 0 comments.

This test (364611247426) was completed on the 29 August 2007 12:34:14 and PASSED the requirements for a valid MOT with 0 comments.

Recorded mileage: 45,912

Recorded mileage: 45,912


MOT TEST: 20 July 2007 09:22:44 FAILED
MOT TEST: 20 July 2007 09:22:44 FAILED

This test (471931907236) was completed on the 20 July 2007 09:22:44 and FAILED the requirements for a valid MOT with 2 comments.

This test (471931907236) was completed on the 20 July 2007 09:22:44 and FAILED the requirements for a valid MOT with 2 comments.

Recorded mileage: 45,904

Recorded mileage: 45,904


FAIL


MOT TEST: 20 July 2007 09:10:14 PASSED
MOT TEST: 20 July 2007 09:10:14 PASSED

This test (240541407245) was completed on the 20 July 2007 09:10:14 and PASSED the requirements for a valid MOT with 0 comments.

This test (240541407245) was completed on the 20 July 2007 09:10:14 and PASSED the requirements for a valid MOT with 0 comments.

Recorded mileage: 45,904

Recorded mileage: 45,904


MOT TEST: 02 March 2006 10:31:00 PASSED
MOT TEST: 02 March 2006 10:31:00 PASSED

This test (404441266069) was completed on the 02 March 2006 10:31:00 and PASSED the requirements for a valid MOT with 0 comments.

This test (404441266069) was completed on the 02 March 2006 10:31:00 and PASSED the requirements for a valid MOT with 0 comments.

Recorded mileage: 44,165

Recorded mileage: 44,165


MOT TEST: 16 February 2006 09:10:12 FAILED
MOT TEST: 16 February 2006 09:10:12 FAILED

This test (764507846081) was completed on the 16 February 2006 09:10:12 and FAILED the requirements for a valid MOT with 2 comments.

This test (764507846081) was completed on the 16 February 2006 09:10:12 and FAILED the requirements for a valid MOT with 2 comments.

Recorded mileage: 44,158

Recorded mileage: 44,158


FAIL