23SUO


23SUO is registered to a Blue 1964, Morris with a Petrol engine. It Failed its most recent MOT Test on the 29 June 2017

11 unique faults (12 Total) reported in its MOT History (5 Tests).

1 common/recurring faults.

60% (3) MOT Pass Rate and a 40% (2) MOT Failure Rate.

68,434 recorded miles.

23SUO


23SUO is registered to a Blue 1964, Morris with a Petrol engine. It Failed its most recent MOT Test on the 29 June 2017

11 unique faults (12 Total) reported in its MOT History (5 Tests).

1 common/recurring faults.

60% (3) MOT Pass Rate and a 40% (2) MOT Failure Rate.

68,434 recorded miles.

MOT PASS/Failure rate for 23SUO

all MOT test results for 23SUO represented as a percentage
MOT PASS/Failure rate for 23SUO
all MOT test results for 23SUO represented as a percentage

PERCENTAGE OF VEHICLE FAULTS WITH 23SUO

ALL REPORTED FAULTS, DISPLAYED BY PERCENTAGE OF OCCURRENCE DURING ALL MOT TESTS
PERCENTAGE OF VEHICLE FAULTS WITH 23SUO
ALL REPORTED FAULTS, DISPLAYED BY PERCENTAGE OF OCCURRENCE DURING ALL MOT TESTS
ADVISORY

FAIL

USER ENTERED

23SUO annual Faults by type

ALL REPORTED FAULTS, DISPLAYED over time and categorised by type
23SUO annual Faults by type
ALL REPORTED FAULTS, DISPLAYED over time and categorised by type

ALL 23SUO ADVISORIES [1]

ALL ADVISORIES, ORDERED by OCCURRENCE DURING 23SUO's MOT HISTORY
ALL 23SUO ADVISORIES [1]
ALL ADVISORIES, ORDERED by OCCURRENCE DURING 23SUO's MOT HISTORY
Fail Faults | source www.vehiclestats.co.uk
Fault Fault Test Date Test Date/Time Reference MOT Test Reference
1 Parking brake: parking brake efficiency only just met. It would appear that the braking system requires adjustment or repair. (3.7.b.7) Parking brake: parking brake efficiency only just met. It would appear that the braking system requires adjustment or repair. (3.7.b.7) 14 August 2009 [15:20] 14/08/2009 374436729252 374436729252

ALL 23SUO Failure Faults [8]

ALL Failure faults, ORDERED by OCCURRENCE DURING 23SUO's MOT HISTORY
ALL 23SUO Failure Faults [8]
ALL Failure faults, ORDERED by OCCURRENCE DURING 23SUO's MOT HISTORY
Fail Faults | source www.vehiclestats.co.uk
Fault Fault Test Date Test Date/Time Reference MOT Test Reference
1 Windscreen washer provides insufficient washer liquid (8.2.3) Windscreen washer provides insufficient washer liquid (8.2.3) 15 June 2017 [17:21] 15/06/2017 749510811222 749510811222
1 Nearside rear brake recording little or no effort (3.7.b.5a) Nearside rear brake recording little or no effort (3.7.b.5a) 15 June 2017 [17:21] 15/06/2017 749510811222 749510811222
1 Offside rear suspension component mounting prescribed area is excessively corroded (2.4.a.3) Offside rear suspension component mounting prescribed area is excessively corroded (2.4.a.3) 15 June 2017 [17:21] 15/06/2017 749510811222 749510811222
1 Nearside rear suspension component mounting prescribed area is excessively corroded (2.4.a.3) Nearside rear suspension component mounting prescribed area is excessively corroded (2.4.a.3) 15 June 2017 [17:21] 15/06/2017 749510811222 749510811222
1 Parking brake: efficiency below requirements (3.7.b.7) Parking brake: efficiency below requirements (3.7.b.7) 15 June 2017 [17:21] 15/06/2017 749510811222 749510811222
1 Rear brakes imbalanced across an axle axle 2 (3.7.b.5b) Rear brakes imbalanced across an axle axle 2 (3.7.b.5b) 15 June 2017 [17:21] 15/06/2017 749510811222 749510811222
1 Exhaust has a major leak of exhaust gases (7.1.2) Exhaust has a major leak of exhaust gases (7.1.2) 14 August 2009 [15:20] 14/08/2009 374436729252 374436729252
1 Offside front brake pipe leaking (3.6.a.1) Offside front brake pipe leaking (3.6.a.1) 14 August 2009 [15:20] 14/08/2009 374436729252 374436729252

ALL 23SUO User Entered Faults [3]

ALL User Entered faults, ORDERED by OCCURRENCE DURING 23SUO's MOT HISTORY
ALL 23SUO User Entered Faults [3]
ALL User Entered faults, ORDERED by OCCURRENCE DURING 23SUO's MOT HISTORY
User Entered Faults | source www.vehiclestats.co.uk
Fault Fault Test Date Test Date/Time Reference MOT Test Reference
2 Surface corrosion front discs Surface corrosion front discs 17 August 2009 [17:19] 17/08/2009 14 August 2009 [15:20] 14/08/2009 573409729262 573409729262 374436729252 374436729252
1 Handbrake just met minimum requirement Handbrake just met minimum requirement 17 August 2009 [17:19] 17/08/2009 573409729262 573409729262

MOT TEST: 29 June 2017 16:23:27 PASSED
MOT TEST: 29 June 2017 16:23:27 PASSED

This test (122798529362) was completed on the 29 June 2017 16:23:27 and PASSED the requirements for a valid MOT with 0 comments.

This test (122798529362) was completed on the 29 June 2017 16:23:27 and PASSED the requirements for a valid MOT with 0 comments.

Recorded mileage: 68,434

Recorded mileage: 68,434


MOT TEST: 15 June 2017 17:21:24 FAILED
MOT TEST: 15 June 2017 17:21:24 FAILED

This test (749510811222) was completed on the 15 June 2017 17:21:24 and FAILED the requirements for a valid MOT with 6 comments.

This test (749510811222) was completed on the 15 June 2017 17:21:24 and FAILED the requirements for a valid MOT with 6 comments.

Recorded mileage: 68,419

Recorded mileage: 68,419


FAIL


MOT TEST: 26 March 2012 15:27:32 PASSED
MOT TEST: 26 March 2012 15:27:32 PASSED

This test (135616082066) was completed on the 26 March 2012 15:27:32 and PASSED the requirements for a valid MOT with 0 comments.

This test (135616082066) was completed on the 26 March 2012 15:27:32 and PASSED the requirements for a valid MOT with 0 comments.

Recorded mileage: 68,277

Recorded mileage: 68,277


MOT TEST: 17 August 2009 17:19:26 PASSED
MOT TEST: 17 August 2009 17:19:26 PASSED

This test (573409729262) was completed on the 17 August 2009 17:19:26 and PASSED the requirements for a valid MOT with 2 comments.

This test (573409729262) was completed on the 17 August 2009 17:19:26 and PASSED the requirements for a valid MOT with 2 comments.

Recorded mileage: 68,026

Recorded mileage: 68,026


USER ENTERED


MOT TEST: 14 August 2009 15:20:49 FAILED
MOT TEST: 14 August 2009 15:20:49 FAILED

This test (374436729252) was completed on the 14 August 2009 15:20:49 and FAILED the requirements for a valid MOT with 4 comments.

This test (374436729252) was completed on the 14 August 2009 15:20:49 and FAILED the requirements for a valid MOT with 4 comments.

Recorded mileage: 68,018

Recorded mileage: 68,018


ADVISORY

FAIL

USER ENTERED