240 EYH


240EYH is registered to a Green 1962, Morris Minor with a Petrol engine. It Failed its most recent MOT Test on the 18 July 2017

24 unique faults (32 Total) reported in its MOT History (9 Tests).

7 common/recurring faults, the most frequent (3 times) is: Offside Rear Suspension spring mounting prescribed area is corroded but not considered excessive (2.4.A.3).

67% (6) MOT Pass Rate and a 33% (3) MOT Failure Rate.

99,580 recorded miles.

240 EYH


240EYH is registered to a Green 1962, Morris Minor with a Petrol engine. It Failed its most recent MOT Test on the 18 July 2017

24 unique faults (32 Total) reported in its MOT History (9 Tests).

7 common/recurring faults, the most frequent (3 times) is: Offside Rear Suspension spring mounting prescribed area is corroded but not considered excessive (2.4.A.3).

67% (6) MOT Pass Rate and a 33% (3) MOT Failure Rate.

99,580 recorded miles.

MOT PASS/Failure rate for 240 EYH

all MOT test results for 240 EYH represented as a percentage
MOT PASS/Failure rate for 240 EYH
all MOT test results for 240 EYH represented as a percentage

PERCENTAGE OF VEHICLE FAULTS WITH 240 EYH

ALL REPORTED FAULTS, DISPLAYED BY PERCENTAGE OF OCCURRENCE DURING ALL MOT TESTS
PERCENTAGE OF VEHICLE FAULTS WITH 240 EYH
ALL REPORTED FAULTS, DISPLAYED BY PERCENTAGE OF OCCURRENCE DURING ALL MOT TESTS
ADVISORY

FAIL

USER ENTERED

240 EYH annual Faults by type

ALL REPORTED FAULTS, DISPLAYED over time and categorised by type
240 EYH annual Faults by type
ALL REPORTED FAULTS, DISPLAYED over time and categorised by type

RECURRING FAULTS WITH 240 EYH

FAULTS THAT HAVE OCCURED MORE THAN ONCE DURING 240 EYH's MOT HISTORY
RECURRING FAULTS WITH 240 EYH
FAULTS THAT HAVE OCCURED MORE THAN ONCE DURING 240 EYH's MOT HISTORY
Fault Fault Test Date Test Date/Time Reference MOT Test Reference
3 Offside rear suspension spring mounting prescribed area is corroded but not considered excessive (2.4.a.3) Offside rear suspension spring mounting prescribed area is corroded but not considered excessive (2.4.a.3) 18 July 2017 [10:56] 18/07/2017 22 August 2011 [16:00] 22/08/2011 16 August 2011 [11:18] 16/08/2011 804927214645 804927214645 286364131253 286364131253 695218121249 695218121249
2 Offside front wheel bearing has slight play (2.5.a.3c) Offside front wheel bearing has slight play (2.5.a.3c) 18 July 2017 [10:56] 18/07/2017 08 August 2016 [11:12] 08/08/2016 804927214645 804927214645 302105277399 302105277399
2 Nearside front axle swivel joint has slight play (2.5.a.3b) Nearside front axle swivel joint has slight play (2.5.a.3b) 17 August 2013 [10:27] 17/08/2013 15 August 2013 [17:55] 15/08/2013 889499023280 889499023280 246737923229 246737923229
2 Nearside front upper suspension arm has slight play in a pin/bush (2.4.g.2) Nearside front upper suspension arm has slight play in a pin/bush (2.4.g.2) 17 August 2013 [10:27] 17/08/2013 15 August 2013 [17:55] 15/08/2013 889499023280 889499023280 246737923229 246737923229
2 Boot has slight corrosion Boot has slight corrosion 17 August 2013 [10:27] 17/08/2013 15 August 2013 [17:55] 15/08/2013 889499023280 889499023280 246737923229 246737923229
2 One of bolts missing from nearside bonnet hinge One of bolts missing from nearside bonnet hinge 22 August 2011 [16:00] 22/08/2011 16 August 2011 [11:18] 16/08/2011 286364131253 286364131253 695218121249 695218121249
2 Signs of corrosion to various parts of underside of car Signs of corrosion to various parts of underside of car 22 August 2011 [16:00] 22/08/2011 16 August 2011 [11:18] 16/08/2011 286364131253 286364131253 695218121249 695218121249

ALL 240 EYH ADVISORIES [17]

ALL ADVISORIES, ORDERED by OCCURRENCE DURING 240 EYH's MOT HISTORY
ALL 240 EYH ADVISORIES [17]
ALL ADVISORIES, ORDERED by OCCURRENCE DURING 240 EYH's MOT HISTORY
Advisory Faults | source www.vehiclestats.co.uk
Fault Fault Test Date Test Date/Time Reference MOT Test Reference
3 Offside rear suspension spring mounting prescribed area is corroded but not considered excessive (2.4.a.3) Offside rear suspension spring mounting prescribed area is corroded but not considered excessive (2.4.a.3) 18 July 2017 [10:56] 18/07/2017 22 August 2011 [16:00] 22/08/2011 16 August 2011 [11:18] 16/08/2011 804927214645 804927214645 286364131253 286364131253 695218121249 695218121249
2 Offside front wheel bearing has slight play (2.5.a.3c) Offside front wheel bearing has slight play (2.5.a.3c) 18 July 2017 [10:56] 18/07/2017 08 August 2016 [11:12] 08/08/2016 804927214645 804927214645 302105277399 302105277399
2 Nearside front axle swivel joint has slight play (2.5.a.3b) Nearside front axle swivel joint has slight play (2.5.a.3b) 17 August 2013 [10:27] 17/08/2013 15 August 2013 [17:55] 15/08/2013 889499023280 889499023280 246737923229 246737923229
2 Nearside front upper suspension arm has slight play in a pin/bush (2.4.g.2) Nearside front upper suspension arm has slight play in a pin/bush (2.4.g.2) 17 August 2013 [10:27] 17/08/2013 15 August 2013 [17:55] 15/08/2013 889499023280 889499023280 246737923229 246737923229
1 Offside front suspension component mounting prescribed area is corroded but not considered excessive base of wheel arch (2.4.a.3) Offside front suspension component mounting prescribed area is corroded but not considered excessive base of wheel arch (2.4.a.3) 18 July 2017 [10:56] 18/07/2017 804927214645 804927214645
1 Nearside front inner wheel arch has a stress fracture by the bump stop however not within a prescribed area Nearside front inner wheel arch has a stress fracture by the bump stop however not within a prescribed area 08 August 2016 [11:12] 08/08/2016 302105277399 302105277399
1 Nearside front inner wheel arch has a stress fracture by the bump stop however not within a prescribed area Nearside front inner wheel arch has a stress fracture by the bump stop however not within a prescribed area 13 August 2015 [14:57] 13/08/2015 796320055760 796320055760
1 Offside front front wheel bearing has slight play (2.5.a.3c) Offside front front wheel bearing has slight play (2.5.a.3c) 13 August 2015 [14:57] 13/08/2015 796320055760 796320055760
1 Nearside front axle king pin has slight play in pin and/or bush (2.5.a.3a) Nearside front axle king pin has slight play in pin and/or bush (2.5.a.3a) 12 August 2014 [13:07] 12/08/2014 768454124261 768454124261
1 Offside front axle king pin has slight play in pin and/or bush (2.5.a.3a) Offside front axle king pin has slight play in pin and/or bush (2.5.a.3a) 12 August 2014 [13:07] 12/08/2014 768454124261 768454124261
1 Offside rear brake pipe slightly corroded (3.6.b.2c) Offside rear brake pipe slightly corroded (3.6.b.2c) 12 August 2014 [13:07] 12/08/2014 768454124261 768454124261
1 Rear brake pipe slightly corroded (3.6.b.2c) Rear brake pipe slightly corroded (3.6.b.2c) 15 March 2013 [17:47] 15/03/2013 608424173067 608424173067

ALL 240 EYH Failure Faults [8]

ALL Failure faults, ORDERED by OCCURRENCE DURING 240 EYH's MOT HISTORY
ALL 240 EYH Failure Faults [8]
ALL Failure faults, ORDERED by OCCURRENCE DURING 240 EYH's MOT HISTORY
Fail Faults | source www.vehiclestats.co.uk
Fault Fault Test Date Test Date/Time Reference MOT Test Reference
1 Registration plate lamp not working (1.1.c.1d) Registration plate lamp not working (1.1.c.1d) 15 August 2013 [17:55] 15/08/2013 246737923229 246737923229
1 Offside rear road wheel distorted (4.2.a.1a) Offside rear road wheel distorted (4.2.a.1a) 15 August 2013 [17:55] 15/08/2013 246737923229 246737923229
1 Nearside rear brake binding (3.7.b.1) Nearside rear brake binding (3.7.b.1) 15 August 2013 [17:55] 15/08/2013 246737923229 246737923229
1 Brakes imbalanced across an axle (3.7.b.5b) Brakes imbalanced across an axle (3.7.b.5b) 15 August 2013 [17:55] 15/08/2013 246737923229 246737923229
1 Offside front body or chassis has excessive corrosion, seriously affecting its strength within 30cm of the body mountings (6.1.b.2) Offside front body or chassis has excessive corrosion, seriously affecting its strength within 30cm of the body mountings (6.1.b.2) 15 March 2013 [17:47] 15/03/2013 608424173067 608424173067
1 Offside rear body or chassis has excessive corrosion, seriously affecting its strength within 30cm of the body mountings (6.1.b.2) Offside rear body or chassis has excessive corrosion, seriously affecting its strength within 30cm of the body mountings (6.1.b.2) 15 March 2013 [17:47] 15/03/2013 608424173067 608424173067
1 Nearside front body or chassis has excessive corrosion, seriously affecting its strength within 30cm of the body mountings (6.1.b.2) Nearside front body or chassis has excessive corrosion, seriously affecting its strength within 30cm of the body mountings (6.1.b.2) 15 March 2013 [17:47] 15/03/2013 608424173067 608424173067
1 Nearside front tyre tread depth below requirements of 1.6mm (4.1.e.1) Nearside front tyre tread depth below requirements of 1.6mm (4.1.e.1) 16 August 2011 [11:18] 16/08/2011 695218121249 695218121249

ALL 240 EYH User Entered Faults [7]

ALL User Entered faults, ORDERED by OCCURRENCE DURING 240 EYH's MOT HISTORY
ALL 240 EYH User Entered Faults [7]
ALL User Entered faults, ORDERED by OCCURRENCE DURING 240 EYH's MOT HISTORY
Advisory Faults | source www.vehiclestats.co.uk
Fault Fault Test Date Test Date/Time Reference MOT Test Reference
2 Boot has slight corrosion Boot has slight corrosion 17 August 2013 [10:27] 17/08/2013 15 August 2013 [17:55] 15/08/2013 889499023280 889499023280 246737923229 246737923229
2 One of bolts missing from nearside bonnet hinge One of bolts missing from nearside bonnet hinge 22 August 2011 [16:00] 22/08/2011 16 August 2011 [11:18] 16/08/2011 286364131253 286364131253 695218121249 695218121249
2 Signs of corrosion to various parts of underside of car Signs of corrosion to various parts of underside of car 22 August 2011 [16:00] 22/08/2011 16 August 2011 [11:18] 16/08/2011 286364131253 286364131253 695218121249 695218121249
1 Rear floorpan has small hole however not within a prescribed area Rear floorpan has small hole however not within a prescribed area 12 August 2014 [13:07] 12/08/2014 768454124261 768454124261

MOT TEST: 18 July 2017 10:56:59 PASSED
MOT TEST: 18 July 2017 10:56:59 PASSED

This test (804927214645) was completed on the 18 July 2017 10:56:59 and PASSED the requirements for a valid MOT with 3 comments.

This test (804927214645) was completed on the 18 July 2017 10:56:59 and PASSED the requirements for a valid MOT with 3 comments.

Recorded mileage: 99,580

Recorded mileage: 99,580


ADVISORY


MOT TEST: 08 August 2016 11:12:47 PASSED
MOT TEST: 08 August 2016 11:12:47 PASSED

This test (302105277399) was completed on the 08 August 2016 11:12:47 and PASSED the requirements for a valid MOT with 2 comments.

This test (302105277399) was completed on the 08 August 2016 11:12:47 and PASSED the requirements for a valid MOT with 2 comments.

Recorded mileage: 98,296

Recorded mileage: 98,296


ADVISORY


MOT TEST: 13 August 2015 14:57:25 PASSED
MOT TEST: 13 August 2015 14:57:25 PASSED

This test (796320055760) was completed on the 13 August 2015 14:57:25 and PASSED the requirements for a valid MOT with 2 comments.

This test (796320055760) was completed on the 13 August 2015 14:57:25 and PASSED the requirements for a valid MOT with 2 comments.

Recorded mileage: 96,741

Recorded mileage: 96,741


ADVISORY


MOT TEST: 12 August 2014 13:07:24 PASSED
MOT TEST: 12 August 2014 13:07:24 PASSED

This test (768454124261) was completed on the 12 August 2014 13:07:24 and PASSED the requirements for a valid MOT with 4 comments.

This test (768454124261) was completed on the 12 August 2014 13:07:24 and PASSED the requirements for a valid MOT with 4 comments.

Recorded mileage: 95,453

Recorded mileage: 95,453


ADVISORY

USER ENTERED


MOT TEST: 17 August 2013 10:27:11 PASSED
MOT TEST: 17 August 2013 10:27:11 PASSED

This test (889499023280) was completed on the 17 August 2013 10:27:11 and PASSED the requirements for a valid MOT with 3 comments.

This test (889499023280) was completed on the 17 August 2013 10:27:11 and PASSED the requirements for a valid MOT with 3 comments.

Recorded mileage: 93,433

Recorded mileage: 93,433


ADVISORY

USER ENTERED


MOT TEST: 15 August 2013 17:55:51 FAILED
MOT TEST: 15 August 2013 17:55:51 FAILED

This test (246737923229) was completed on the 15 August 2013 17:55:51 and FAILED the requirements for a valid MOT with 7 comments.

This test (246737923229) was completed on the 15 August 2013 17:55:51 and FAILED the requirements for a valid MOT with 7 comments.

Recorded mileage: 93,433

Recorded mileage: 93,433


ADVISORY

FAIL

USER ENTERED


MOT TEST: 15 March 2013 17:47:33 FAILED
MOT TEST: 15 March 2013 17:47:33 FAILED

This test (608424173067) was completed on the 15 March 2013 17:47:33 and FAILED the requirements for a valid MOT with 4 comments.

This test (608424173067) was completed on the 15 March 2013 17:47:33 and FAILED the requirements for a valid MOT with 4 comments.

Recorded mileage: 92,535

Recorded mileage: 92,535


ADVISORY

FAIL


MOT TEST: 22 August 2011 16:00:33 PASSED
MOT TEST: 22 August 2011 16:00:33 PASSED

This test (286364131253) was completed on the 22 August 2011 16:00:33 and PASSED the requirements for a valid MOT with 3 comments.

This test (286364131253) was completed on the 22 August 2011 16:00:33 and PASSED the requirements for a valid MOT with 3 comments.

Recorded mileage: 89,085

Recorded mileage: 89,085


ADVISORY

USER ENTERED


MOT TEST: 16 August 2011 11:18:54 FAILED
MOT TEST: 16 August 2011 11:18:54 FAILED

This test (695218121249) was completed on the 16 August 2011 11:18:54 and FAILED the requirements for a valid MOT with 4 comments.

This test (695218121249) was completed on the 16 August 2011 11:18:54 and FAILED the requirements for a valid MOT with 4 comments.

Recorded mileage: 89,085

Recorded mileage: 89,085


ADVISORY

FAIL

USER ENTERED