240 GUE


240GUE is registered to a Maroon 1963, Morris Minor 1000 with a Petrol engine. It Failed its most recent MOT Test on the 09 June 2017

13 unique faults (15 Total) reported in its MOT History (9 Tests).

1 common/recurring faults.

78% (7) MOT Pass Rate and a 22% (2) MOT Failure Rate.

2,738 recorded miles.

240 GUE


240GUE is registered to a Maroon 1963, Morris Minor 1000 with a Petrol engine. It Failed its most recent MOT Test on the 09 June 2017

13 unique faults (15 Total) reported in its MOT History (9 Tests).

1 common/recurring faults.

78% (7) MOT Pass Rate and a 22% (2) MOT Failure Rate.

2,738 recorded miles.

MOT PASS/Failure rate for 240 GUE

all MOT test results for 240 GUE represented as a percentage
MOT PASS/Failure rate for 240 GUE
all MOT test results for 240 GUE represented as a percentage

PERCENTAGE OF VEHICLE FAULTS WITH 240 GUE

ALL REPORTED FAULTS, DISPLAYED BY PERCENTAGE OF OCCURRENCE DURING ALL MOT TESTS
PERCENTAGE OF VEHICLE FAULTS WITH 240 GUE
ALL REPORTED FAULTS, DISPLAYED BY PERCENTAGE OF OCCURRENCE DURING ALL MOT TESTS
ADVISORY

FAIL

USER ENTERED

240 GUE annual Faults by type

ALL REPORTED FAULTS, DISPLAYED over time and categorised by type
240 GUE annual Faults by type
ALL REPORTED FAULTS, DISPLAYED over time and categorised by type

ALL 240 GUE ADVISORIES [1]

ALL ADVISORIES, ORDERED by OCCURRENCE DURING 240 GUE's MOT HISTORY
ALL 240 GUE ADVISORIES [1]
ALL ADVISORIES, ORDERED by OCCURRENCE DURING 240 GUE's MOT HISTORY
Advisory Faults | source www.vehiclestats.co.uk
Fault Fault Test Date Test Date/Time Reference MOT Test Reference
1 Nearside brakes imbalanced requirements only just met. It would appear that the braking system requires adjustment or repair. (3.7.b.5b) Nearside brakes imbalanced requirements only just met. It would appear that the braking system requires adjustment or repair. (3.7.b.5b) 09 August 2011 [13:31] 09/08/2011 357331621236 357331621236

ALL 240 GUE Failure Faults [5]

ALL Failure faults, ORDERED by OCCURRENCE DURING 240 GUE's MOT HISTORY
ALL 240 GUE Failure Faults [5]
ALL Failure faults, ORDERED by OCCURRENCE DURING 240 GUE's MOT HISTORY
Fail Faults | source www.vehiclestats.co.uk
Fault Fault Test Date Test Date/Time Reference MOT Test Reference
1 Nearside front wheel bearing rough when rotated (2.5.a.2) Nearside front wheel bearing rough when rotated (2.5.a.2) 31 May 2017 [08:06] 31/05/2017 248561660455 248561660455
1 Nearside steering rack gaiter split (2.2.d.2d) Nearside steering rack gaiter split (2.2.d.2d) 31 May 2017 [08:06] 31/05/2017 248561660455 248561660455
1 Offside rear axle beam cracked corroded and holed at leaf spring shackle mount (2.5.a.5a) Offside rear axle beam cracked corroded and holed at leaf spring shackle mount (2.5.a.5a) 31 May 2017 [08:06] 31/05/2017 248561660455 248561660455
1 Offside rear parking brake recording little or no effort (3.7.b.6a) Offside rear parking brake recording little or no effort (3.7.b.6a) 19 June 2006 [14:27] 19/06/2006 121780976191 121780976191
1 Parking brake: efficiency below requirements (3.7.b.7) Parking brake: efficiency below requirements (3.7.b.7) 19 June 2006 [14:27] 19/06/2006 121780976191 121780976191

ALL 240 GUE User Entered Faults [9]

ALL User Entered faults, ORDERED by OCCURRENCE DURING 240 GUE's MOT HISTORY
ALL 240 GUE User Entered Faults [9]
ALL User Entered faults, ORDERED by OCCURRENCE DURING 240 GUE's MOT HISTORY
User Entered Faults | source www.vehiclestats.co.uk
Fault Fault Test Date Test Date/Time Reference MOT Test Reference
3 Oil leak Oil leak 05 August 2013 [15:49] 05/08/2013 31 July 2012 [15:40] 31/07/2012 09 August 2011 [13:31] 09/08/2011 379027313483 379027313483 919573412269 919573412269 357331621236 357331621236
1 Engine oil leak Engine oil leak 06 August 2014 [11:56] 06/08/2014 106158114214 106158114214
1 Oil leak from nearside rear hub Oil leak from nearside rear hub 06 August 2014 [11:56] 06/08/2014 106158114214 106158114214
1 Nearsdie rear hub leaking gear oil Nearsdie rear hub leaking gear oil 05 August 2013 [15:49] 05/08/2013 379027313483 379027313483
1 Front and rear suspension bump stops missing Front and rear suspension bump stops missing 31 July 2012 [15:40] 31/07/2012 919573412269 919573412269
1 Offside front, offside rear and nearside rear suspension bump stops missing Offside front, offside rear and nearside rear suspension bump stops missing 09 August 2011 [13:31] 09/08/2011 357331621236 357331621236
1 Nearside front brake slightly binding Nearside front brake slightly binding 09 August 2011 [13:31] 09/08/2011 357331621236 357331621236

MOT TEST: 09 June 2017 08:33:48 PASSED
MOT TEST: 09 June 2017 08:33:48 PASSED

This test (441716887466) was completed on the 09 June 2017 08:33:48 and PASSED the requirements for a valid MOT with 0 comments.

This test (441716887466) was completed on the 09 June 2017 08:33:48 and PASSED the requirements for a valid MOT with 0 comments.

Recorded mileage: 2,738

Recorded mileage: 2,738


MOT TEST: 31 May 2017 08:06:51 FAILED
MOT TEST: 31 May 2017 08:06:51 FAILED

This test (248561660455) was completed on the 31 May 2017 08:06:51 and FAILED the requirements for a valid MOT with 3 comments.

This test (248561660455) was completed on the 31 May 2017 08:06:51 and FAILED the requirements for a valid MOT with 3 comments.

Recorded mileage: 2,738

Recorded mileage: 2,738


FAIL


MOT TEST: 05 August 2015 13:32:21 PASSED
MOT TEST: 05 August 2015 13:32:21 PASSED

This test (659777915266) was completed on the 05 August 2015 13:32:21 and PASSED the requirements for a valid MOT with 0 comments.

This test (659777915266) was completed on the 05 August 2015 13:32:21 and PASSED the requirements for a valid MOT with 0 comments.

Recorded mileage: 2,336

Recorded mileage: 2,336


MOT TEST: 06 August 2014 11:56:34 PASSED
MOT TEST: 06 August 2014 11:56:34 PASSED

This test (106158114214) was completed on the 06 August 2014 11:56:34 and PASSED the requirements for a valid MOT with 2 comments.

This test (106158114214) was completed on the 06 August 2014 11:56:34 and PASSED the requirements for a valid MOT with 2 comments.

Recorded mileage: 2,203

Recorded mileage: 2,203


USER ENTERED


MOT TEST: 05 August 2013 15:49:08 PASSED
MOT TEST: 05 August 2013 15:49:08 PASSED

This test (379027313483) was completed on the 05 August 2013 15:49:08 and PASSED the requirements for a valid MOT with 2 comments.

This test (379027313483) was completed on the 05 August 2013 15:49:08 and PASSED the requirements for a valid MOT with 2 comments.

Recorded mileage: 2,137

Recorded mileage: 2,137


USER ENTERED


MOT TEST: 31 July 2012 15:40:28 PASSED
MOT TEST: 31 July 2012 15:40:28 PASSED

This test (919573412269) was completed on the 31 July 2012 15:40:28 and PASSED the requirements for a valid MOT with 2 comments.

This test (919573412269) was completed on the 31 July 2012 15:40:28 and PASSED the requirements for a valid MOT with 2 comments.

Recorded mileage: 2,029

Recorded mileage: 2,029


USER ENTERED


MOT TEST: 09 August 2011 13:31:14 PASSED
MOT TEST: 09 August 2011 13:31:14 PASSED

This test (357331621236) was completed on the 09 August 2011 13:31:14 and PASSED the requirements for a valid MOT with 4 comments.

This test (357331621236) was completed on the 09 August 2011 13:31:14 and PASSED the requirements for a valid MOT with 4 comments.

Recorded mileage: 1,937

Recorded mileage: 1,937


ADVISORY

USER ENTERED


MOT TEST: 19 June 2006 16:26:07 PASSED
MOT TEST: 19 June 2006 16:26:07 PASSED

This test (200060676108) was completed on the 19 June 2006 16:26:07 and PASSED the requirements for a valid MOT with 0 comments.

This test (200060676108) was completed on the 19 June 2006 16:26:07 and PASSED the requirements for a valid MOT with 0 comments.

Recorded mileage: 1,911

Recorded mileage: 1,911


MOT TEST: 19 June 2006 14:27:06 FAILED
MOT TEST: 19 June 2006 14:27:06 FAILED

This test (121780976191) was completed on the 19 June 2006 14:27:06 and FAILED the requirements for a valid MOT with 2 comments.

This test (121780976191) was completed on the 19 June 2006 14:27:06 and FAILED the requirements for a valid MOT with 2 comments.

Recorded mileage: 1,911

Recorded mileage: 1,911


FAIL