242 AYV


242AYV is registered to a Grey 1961, Morris Minor with a Petrol engine. It Failed its most recent MOT Test on the 09 November 2017

27 unique faults (39 Total) reported in its MOT History (13 Tests).

8 common/recurring faults, the most frequent (4 times) is: Nearside Rear Leaf spring has a slightly deteriorated shackle pin rubber bush not resulting in excessive movement (2.4.B.2).

62% (8) MOT Pass Rate and a 38% (5) MOT Failure Rate.

68,949 recorded miles.

242 AYV


242AYV is registered to a Grey 1961, Morris Minor with a Petrol engine. It Failed its most recent MOT Test on the 09 November 2017

27 unique faults (39 Total) reported in its MOT History (13 Tests).

8 common/recurring faults, the most frequent (4 times) is: Nearside Rear Leaf spring has a slightly deteriorated shackle pin rubber bush not resulting in excessive movement (2.4.B.2).

62% (8) MOT Pass Rate and a 38% (5) MOT Failure Rate.

68,949 recorded miles.

MOT PASS/Failure rate for 242 AYV

all MOT test results for 242 AYV represented as a percentage
MOT PASS/Failure rate for 242 AYV
all MOT test results for 242 AYV represented as a percentage

PERCENTAGE OF VEHICLE FAULTS WITH 242 AYV

ALL REPORTED FAULTS, DISPLAYED BY PERCENTAGE OF OCCURRENCE DURING ALL MOT TESTS
PERCENTAGE OF VEHICLE FAULTS WITH 242 AYV
ALL REPORTED FAULTS, DISPLAYED BY PERCENTAGE OF OCCURRENCE DURING ALL MOT TESTS
ADVISORY

FAIL

USER ENTERED

PASS WITH RECTIFICATION

242 AYV annual Faults by type

ALL REPORTED FAULTS, DISPLAYED over time and categorised by type
242 AYV annual Faults by type
ALL REPORTED FAULTS, DISPLAYED over time and categorised by type

RECURRING FAULTS WITH 242 AYV

FAULTS THAT HAVE OCCURED MORE THAN ONCE DURING 242 AYV's MOT HISTORY
RECURRING FAULTS WITH 242 AYV
FAULTS THAT HAVE OCCURED MORE THAN ONCE DURING 242 AYV's MOT HISTORY
Fault Fault Test Date Test Date/Time Reference MOT Test Reference
4 Nearside rear leaf spring has a slightly deteriorated shackle pin rubber bush not resulting in excessive movement (2.4.b.2) Nearside rear leaf spring has a slightly deteriorated shackle pin rubber bush not resulting in excessive movement (2.4.b.2) 09 November 2017 [11:41] 09/11/2017 09 November 2017 [09:03] 09/11/2017 15 September 2015 [12:02] 15/09/2015 15 September 2015 [08:39] 15/09/2015 726200405455 726200405455 931123396667 931123396667 765666901572 765666901572 944097329029 944097329029
4 Offside rear leaf spring has a slightly deteriorated shackle pin rubber bush not resulting in excessive movement (2.4.b.2) Offside rear leaf spring has a slightly deteriorated shackle pin rubber bush not resulting in excessive movement (2.4.b.2) 09 November 2017 [11:41] 09/11/2017 09 November 2017 [09:03] 09/11/2017 15 September 2015 [12:02] 15/09/2015 15 September 2015 [08:39] 15/09/2015 726200405455 726200405455 931123396667 931123396667 765666901572 765666901572 944097329029 944097329029
2 Rear brake pipe slightly corroded (3.6.b.2c) Rear brake pipe slightly corroded (3.6.b.2c) 09 November 2017 [11:41] 09/11/2017 09 November 2017 [09:03] 09/11/2017 726200405455 726200405455 931123396667 931123396667
2 Nearside leaf spring has slight wear in an anchor pin and/or bush (2.4.b.2) Nearside leaf spring has slight wear in an anchor pin and/or bush (2.4.b.2) 09 November 2017 [11:41] 09/11/2017 09 November 2017 [09:03] 09/11/2017 726200405455 726200405455 931123396667 931123396667
2 Offside leaf spring has slight wear in an anchor pin and/or bush (2.4.b.2) Offside leaf spring has slight wear in an anchor pin and/or bush (2.4.b.2) 09 November 2017 [11:41] 09/11/2017 09 November 2017 [09:03] 09/11/2017 726200405455 726200405455 931123396667 931123396667
2 Front brakes imbalanced across an axle (3.7.b.5b) Front brakes imbalanced across an axle (3.7.b.5b) 09 November 2017 [09:03] 09/11/2017 20 September 2017 [08:55] 20/09/2017 931123396667 931123396667 591113537807 591113537807
2 Nearside front suspension component mounting prescribed area is corroded but not considered excessive chassis (2.4.a.3) Nearside front suspension component mounting prescribed area is corroded but not considered excessive chassis (2.4.a.3) 15 September 2015 [12:02] 15/09/2015 15 September 2015 [08:39] 15/09/2015 765666901572 765666901572 944097329029 944097329029
2 Offside front suspension component mounting prescribed area is corroded but not considered excessive chassis (2.4.a.3) Offside front suspension component mounting prescribed area is corroded but not considered excessive chassis (2.4.a.3) 15 September 2015 [12:02] 15/09/2015 15 September 2015 [08:39] 15/09/2015 765666901572 765666901572 944097329029 944097329029

ALL 242 AYV ADVISORIES [20]

ALL ADVISORIES, ORDERED by OCCURRENCE DURING 242 AYV's MOT HISTORY
ALL 242 AYV ADVISORIES [20]
ALL ADVISORIES, ORDERED by OCCURRENCE DURING 242 AYV's MOT HISTORY
Advisory Faults | source www.vehiclestats.co.uk
Fault Fault Test Date Test Date/Time Reference MOT Test Reference
4 Nearside rear leaf spring has a slightly deteriorated shackle pin rubber bush not resulting in excessive movement (2.4.b.2) Nearside rear leaf spring has a slightly deteriorated shackle pin rubber bush not resulting in excessive movement (2.4.b.2) 09 November 2017 [11:41] 09/11/2017 09 November 2017 [09:03] 09/11/2017 15 September 2015 [12:02] 15/09/2015 15 September 2015 [08:39] 15/09/2015 726200405455 726200405455 931123396667 931123396667 765666901572 765666901572 944097329029 944097329029
4 Offside rear leaf spring has a slightly deteriorated shackle pin rubber bush not resulting in excessive movement (2.4.b.2) Offside rear leaf spring has a slightly deteriorated shackle pin rubber bush not resulting in excessive movement (2.4.b.2) 09 November 2017 [11:41] 09/11/2017 09 November 2017 [09:03] 09/11/2017 15 September 2015 [12:02] 15/09/2015 15 September 2015 [08:39] 15/09/2015 726200405455 726200405455 931123396667 931123396667 765666901572 765666901572 944097329029 944097329029
2 Rear brake pipe slightly corroded (3.6.b.2c) Rear brake pipe slightly corroded (3.6.b.2c) 09 November 2017 [11:41] 09/11/2017 09 November 2017 [09:03] 09/11/2017 726200405455 726200405455 931123396667 931123396667
2 Nearside leaf spring has slight wear in an anchor pin and/or bush (2.4.b.2) Nearside leaf spring has slight wear in an anchor pin and/or bush (2.4.b.2) 09 November 2017 [11:41] 09/11/2017 09 November 2017 [09:03] 09/11/2017 726200405455 726200405455 931123396667 931123396667
2 Offside leaf spring has slight wear in an anchor pin and/or bush (2.4.b.2) Offside leaf spring has slight wear in an anchor pin and/or bush (2.4.b.2) 09 November 2017 [11:41] 09/11/2017 09 November 2017 [09:03] 09/11/2017 726200405455 726200405455 931123396667 931123396667
2 Nearside front suspension component mounting prescribed area is corroded but not considered excessive chassis (2.4.a.3) Nearside front suspension component mounting prescribed area is corroded but not considered excessive chassis (2.4.a.3) 15 September 2015 [12:02] 15/09/2015 15 September 2015 [08:39] 15/09/2015 765666901572 765666901572 944097329029 944097329029
2 Offside front suspension component mounting prescribed area is corroded but not considered excessive chassis (2.4.a.3) Offside front suspension component mounting prescribed area is corroded but not considered excessive chassis (2.4.a.3) 15 September 2015 [12:02] 15/09/2015 15 September 2015 [08:39] 15/09/2015 765666901572 765666901572 944097329029 944097329029
1 Small play in both front top suspension units / off side front /near side front Small play in both front top suspension units / off side front /near side front 20 September 2017 [08:55] 20/09/2017 591113537807 591113537807
1 Offside rear brake pipe slightly corroded (3.6.b.2c) Offside rear brake pipe slightly corroded (3.6.b.2c) 20 September 2017 [08:55] 20/09/2017 591113537807 591113537807

ALL 242 AYV Failure Faults [16]

ALL Failure faults, ORDERED by OCCURRENCE DURING 242 AYV's MOT HISTORY
ALL 242 AYV Failure Faults [16]
ALL Failure faults, ORDERED by OCCURRENCE DURING 242 AYV's MOT HISTORY
Advisory Faults | source www.vehiclestats.co.uk
Fault Fault Test Date Test Date/Time Reference MOT Test Reference
2 Front brakes imbalanced across an axle (3.7.b.5b) Front brakes imbalanced across an axle (3.7.b.5b) 09 November 2017 [09:03] 09/11/2017 20 September 2017 [08:55] 20/09/2017 931123396667 931123396667 591113537807 591113537807
1 Service brake: efficiency below requirements (3.7.b.7) Service brake: efficiency below requirements (3.7.b.7) 09 November 2017 [09:03] 09/11/2017 931123396667 931123396667
1 Offside front hydraulic brake cylinder leaking hydraulic fluid (3.6.a.1) Offside front hydraulic brake cylinder leaking hydraulic fluid (3.6.a.1) 20 September 2017 [08:55] 20/09/2017 591113537807 591113537807
1 Offside front brakes imbalanced across an axle low (3.7.b.5b) Offside front brakes imbalanced across an axle low (3.7.b.5b) 20 September 2017 [08:55] 20/09/2017 591113537807 591113537807
1 Offside front brakes imbalanced across an axle (3.7.b.5b) Offside front brakes imbalanced across an axle (3.7.b.5b) 15 September 2015 [08:39] 15/09/2015 944097329029 944097329029
1 Offside front front brake application uneven (3.7.b.2) Offside front front brake application uneven (3.7.b.2) 15 September 2015 [08:39] 15/09/2015 944097329029 944097329029
1 Nearside front front brake binding (3.7.b.1) Nearside front front brake binding (3.7.b.1) 09 September 2010 [09:40] 09/09/2010 370672050222 370672050222
1 Offside front front brake binding (3.7.b.1) Offside front front brake binding (3.7.b.1) 09 September 2010 [09:40] 09/09/2010 370672050222 370672050222
1 Nearside rear front brake binding (3.7.b.1) Nearside rear front brake binding (3.7.b.1) 09 September 2010 [09:40] 09/09/2010 370672050222 370672050222
1 Nearside rear front brake recording little or no effort (3.7.b.5a) Nearside rear front brake recording little or no effort (3.7.b.5a) 09 September 2010 [09:40] 09/09/2010 370672050222 370672050222
1 Nearside front parking brake recording little or no effort (3.7.b.6a) Nearside front parking brake recording little or no effort (3.7.b.6a) 09 September 2010 [09:40] 09/09/2010 370672050222 370672050222
1 Brake pedal anti-slip provision missing (3.3.a.1b) Brake pedal anti-slip provision missing (3.3.a.1b) 09 September 2010 [09:40] 09/09/2010 370672050222 370672050222
1 Horn not working (1.6.2a) Horn not working (1.6.2a) 09 September 2010 [09:40] 09/09/2010 370672050222 370672050222
1 Exhaust has a major leak of exhaust gases (7.1.2) Exhaust has a major leak of exhaust gases (7.1.2) 09 September 2010 [09:40] 09/09/2010 370672050222 370672050222
1 Parking brake: efficiency below requirements (3.7.b.7) Parking brake: efficiency below requirements (3.7.b.7) 09 September 2010 [09:40] 09/09/2010 370672050222 370672050222

ALL 242 AYV User Entered Faults [2]

ALL User Entered faults, ORDERED by OCCURRENCE DURING 242 AYV's MOT HISTORY
ALL 242 AYV User Entered Faults [2]
ALL User Entered faults, ORDERED by OCCURRENCE DURING 242 AYV's MOT HISTORY
User Entered Faults | source www.vehiclestats.co.uk
Fault Fault Test Date Test Date/Time Reference MOT Test Reference
1 O/s/front lower suspension trunion slight wear. O/s/front lower suspension trunion slight wear. 28 August 2013 [09:10] 28/08/2013 816830343226 816830343226
1 Slight leak from both rear hub seals. Slight leak from both rear hub seals. 28 August 2013 [09:10] 28/08/2013 816830343226 816830343226

ALL 242 AYV Pass With Rectification Faults [1]

ALL Pass With Rectification faults, ORDERED by OCCURRENCE DURING 242 AYV's MOT HISTORY
ALL 242 AYV Pass With Rectification Faults [1]
ALL Pass With Rectification faults, ORDERED by OCCURRENCE DURING 242 AYV's MOT HISTORY
Pass With Rectification Faults | source www.vehiclestats.co.uk
Fault Fault Test Date Test Date/Time Reference MOT Test Reference
1 Nearside front tyre tread depth below requirements of 1.6mm (4.1.e.1) Nearside front tyre tread depth below requirements of 1.6mm (4.1.e.1) 13 September 2011 [09:21] 13/09/2011 407896651293 407896651293

MOT TEST: 09 November 2017 11:41:38 PASSED
MOT TEST: 09 November 2017 11:41:38 PASSED

This test (726200405455) was completed on the 09 November 2017 11:41:38 and PASSED the requirements for a valid MOT with 5 comments.

This test (726200405455) was completed on the 09 November 2017 11:41:38 and PASSED the requirements for a valid MOT with 5 comments.

Recorded mileage: 68,949

Recorded mileage: 68,949


ADVISORY


MOT TEST: 09 November 2017 09:03:28 FAILED
MOT TEST: 09 November 2017 09:03:28 FAILED

This test (931123396667) was completed on the 09 November 2017 09:03:28 and FAILED the requirements for a valid MOT with 7 comments.

This test (931123396667) was completed on the 09 November 2017 09:03:28 and FAILED the requirements for a valid MOT with 7 comments.

Recorded mileage: 68,948

Recorded mileage: 68,948


ADVISORY

FAIL


MOT TEST: 20 September 2017 08:55:21 FAILED
MOT TEST: 20 September 2017 08:55:21 FAILED

This test (591113537807) was completed on the 20 September 2017 08:55:21 and FAILED the requirements for a valid MOT with 5 comments.

This test (591113537807) was completed on the 20 September 2017 08:55:21 and FAILED the requirements for a valid MOT with 5 comments.

Recorded mileage: 68,944

Recorded mileage: 68,944


ADVISORY

FAIL


MOT TEST: 06 September 2016 07:57:44 PASSED
MOT TEST: 06 September 2016 07:57:44 PASSED

This test (959052003807) was completed on the 06 September 2016 07:57:44 and PASSED the requirements for a valid MOT with 0 comments.

This test (959052003807) was completed on the 06 September 2016 07:57:44 and PASSED the requirements for a valid MOT with 0 comments.

Recorded mileage: 68,495

Recorded mileage: 68,495


MOT TEST: 15 September 2015 12:02:59 PASSED
MOT TEST: 15 September 2015 12:02:59 PASSED

This test (765666901572) was completed on the 15 September 2015 12:02:59 and PASSED the requirements for a valid MOT with 4 comments.

This test (765666901572) was completed on the 15 September 2015 12:02:59 and PASSED the requirements for a valid MOT with 4 comments.

Recorded mileage: 67,982

Recorded mileage: 67,982


ADVISORY


MOT TEST: 15 September 2015 08:39:49 FAILED
MOT TEST: 15 September 2015 08:39:49 FAILED

This test (944097329029) was completed on the 15 September 2015 08:39:49 and FAILED the requirements for a valid MOT with 6 comments.

This test (944097329029) was completed on the 15 September 2015 08:39:49 and FAILED the requirements for a valid MOT with 6 comments.

Recorded mileage: 67,980

Recorded mileage: 67,980


ADVISORY

FAIL


MOT TEST: 01 September 2014 09:16:36 PASSED
MOT TEST: 01 September 2014 09:16:36 PASSED

This test (196444344218) was completed on the 01 September 2014 09:16:36 and PASSED the requirements for a valid MOT with 0 comments.

This test (196444344218) was completed on the 01 September 2014 09:16:36 and PASSED the requirements for a valid MOT with 0 comments.

Recorded mileage: 67,561

Recorded mileage: 67,561


MOT TEST: 28 August 2013 09:10:45 PASSED
MOT TEST: 28 August 2013 09:10:45 PASSED

This test (816830343226) was completed on the 28 August 2013 09:10:45 and PASSED the requirements for a valid MOT with 2 comments.

This test (816830343226) was completed on the 28 August 2013 09:10:45 and PASSED the requirements for a valid MOT with 2 comments.

Recorded mileage: 67,209

Recorded mileage: 67,209


USER ENTERED


MOT TEST: 28 August 2012 09:35:12 PASSED
MOT TEST: 28 August 2012 09:35:12 PASSED

This test (827301642272) was completed on the 28 August 2012 09:35:12 and PASSED the requirements for a valid MOT with 0 comments.

This test (827301642272) was completed on the 28 August 2012 09:35:12 and PASSED the requirements for a valid MOT with 0 comments.

Recorded mileage: 66,567

Recorded mileage: 66,567


MOT TEST: 13 September 2011 09:21:24 PASSED
MOT TEST: 13 September 2011 09:21:24 PASSED

This test (648816951297) was completed on the 13 September 2011 09:21:24 and PASSED the requirements for a valid MOT with 0 comments.

This test (648816951297) was completed on the 13 September 2011 09:21:24 and PASSED the requirements for a valid MOT with 0 comments.

Recorded mileage: 66,141

Recorded mileage: 66,141


MOT TEST: 13 September 2011 09:21:24 FAILED
MOT TEST: 13 September 2011 09:21:24 FAILED

This test (407896651293) was completed on the 13 September 2011 09:21:24 and FAILED the requirements for a valid MOT with 1 comments.

This test (407896651293) was completed on the 13 September 2011 09:21:24 and FAILED the requirements for a valid MOT with 1 comments.

Recorded mileage: 66,141

Recorded mileage: 66,141


PASS WITH RECTIFICATION


MOT TEST: 14 September 2010 10:51:40 PASSED
MOT TEST: 14 September 2010 10:51:40 PASSED

This test (283317550264) was completed on the 14 September 2010 10:51:40 and PASSED the requirements for a valid MOT with 0 comments.

This test (283317550264) was completed on the 14 September 2010 10:51:40 and PASSED the requirements for a valid MOT with 0 comments.

Recorded mileage: 64,792

Recorded mileage: 64,792


MOT TEST: 09 September 2010 09:40:43 FAILED
MOT TEST: 09 September 2010 09:40:43 FAILED

This test (370672050222) was completed on the 09 September 2010 09:40:43 and FAILED the requirements for a valid MOT with 9 comments.

This test (370672050222) was completed on the 09 September 2010 09:40:43 and FAILED the requirements for a valid MOT with 9 comments.

Recorded mileage: 64,787

Recorded mileage: 64,787


FAIL