243 GHK


243GHK is registered to a Grey 1956, Morris Minor with a Petrol engine. It Failed its most recent MOT Test on the 18 November 2008

8 unique faults (9 Total) reported in its MOT History (4 Tests).

1 common/recurring faults.

50% (2) MOT Pass Rate and a 50% (2) MOT Failure Rate.

120,499 recorded miles.

243 GHK


243GHK is registered to a Grey 1956, Morris Minor with a Petrol engine. It Failed its most recent MOT Test on the 18 November 2008

8 unique faults (9 Total) reported in its MOT History (4 Tests).

1 common/recurring faults.

50% (2) MOT Pass Rate and a 50% (2) MOT Failure Rate.

120,499 recorded miles.

MOT PASS/Failure rate for 243 GHK

all MOT test results for 243 GHK represented as a percentage
MOT PASS/Failure rate for 243 GHK
all MOT test results for 243 GHK represented as a percentage

PERCENTAGE OF VEHICLE FAULTS WITH 243 GHK

ALL REPORTED FAULTS, DISPLAYED BY PERCENTAGE OF OCCURRENCE DURING ALL MOT TESTS
PERCENTAGE OF VEHICLE FAULTS WITH 243 GHK
ALL REPORTED FAULTS, DISPLAYED BY PERCENTAGE OF OCCURRENCE DURING ALL MOT TESTS
ADVISORY

FAIL

243 GHK annual Faults by type

ALL REPORTED FAULTS, DISPLAYED over time and categorised by type
243 GHK annual Faults by type
ALL REPORTED FAULTS, DISPLAYED over time and categorised by type

ALL 243 GHK ADVISORIES [1]

ALL ADVISORIES, ORDERED by OCCURRENCE DURING 243 GHK's MOT HISTORY
ALL 243 GHK ADVISORIES [1]
ALL ADVISORIES, ORDERED by OCCURRENCE DURING 243 GHK's MOT HISTORY
Fail Faults | source www.vehiclestats.co.uk
Fault Fault Test Date Test Date/Time Reference MOT Test Reference
1 Nearside suspension component mounting prescribed area is corroded but not considered excessive (2.4.a.3) Nearside suspension component mounting prescribed area is corroded but not considered excessive (2.4.a.3) 06 November 2008 [20:51] 06/11/2008 953001318392 953001318392

ALL 243 GHK Failure Faults [8]

ALL Failure faults, ORDERED by OCCURRENCE DURING 243 GHK's MOT HISTORY
ALL 243 GHK Failure Faults [8]
ALL Failure faults, ORDERED by OCCURRENCE DURING 243 GHK's MOT HISTORY
Fail Faults | source www.vehiclestats.co.uk
Fault Fault Test Date Test Date/Time Reference MOT Test Reference
2 Nearside rear braking system leaking (3.6.a.1) Nearside rear braking system leaking (3.6.a.1) 06 November 2008 [20:51] 06/11/2008 08 September 2006 [17:12] 08/09/2006 953001318392 953001318392 754981656261 754981656261
1 Nearside front position lamp(s) not working (1.1.a.3b) Nearside front position lamp(s) not working (1.1.a.3b) 06 November 2008 [20:51] 06/11/2008 953001318392 953001318392
1 Offside front brake binding (3.7.b.1) Offside front brake binding (3.7.b.1) 06 November 2008 [20:51] 06/11/2008 953001318392 953001318392
1 Windscreen washer provides insufficient washer liquid (8.2.3) Windscreen washer provides insufficient washer liquid (8.2.3) 06 November 2008 [20:51] 06/11/2008 953001318392 953001318392
1 Offside rear tyre has a cut in excess of the requirements deep enough to reach the ply or cords (4.1.d.1a) Offside rear tyre has a cut in excess of the requirements deep enough to reach the ply or cords (4.1.d.1a) 08 September 2006 [17:12] 08/09/2006 754981656261 754981656261
1 Offside front seat belt anchorage prescribed area is excessively corroded (5.2.6) Offside front seat belt anchorage prescribed area is excessively corroded (5.2.6) 08 September 2006 [17:12] 08/09/2006 754981656261 754981656261
1 Nearside front seat belt anchorage prescribed area is excessively corroded (5.2.6) Nearside front seat belt anchorage prescribed area is excessively corroded (5.2.6) 08 September 2006 [17:12] 08/09/2006 754981656261 754981656261

MOT TEST: 18 November 2008 21:26:02 PASSED
MOT TEST: 18 November 2008 21:26:02 PASSED

This test (391443528302) was completed on the 18 November 2008 21:26:02 and PASSED the requirements for a valid MOT with 0 comments.

This test (391443528302) was completed on the 18 November 2008 21:26:02 and PASSED the requirements for a valid MOT with 0 comments.

Recorded mileage: 120,499

Recorded mileage: 120,499


MOT TEST: 06 November 2008 20:51:34 FAILED
MOT TEST: 06 November 2008 20:51:34 FAILED

This test (953001318392) was completed on the 06 November 2008 20:51:34 and FAILED the requirements for a valid MOT with 5 comments.

This test (953001318392) was completed on the 06 November 2008 20:51:34 and FAILED the requirements for a valid MOT with 5 comments.

Recorded mileage: 120,499

Recorded mileage: 120,499


ADVISORY

FAIL


MOT TEST: 16 September 2006 14:41:13 PASSED
MOT TEST: 16 September 2006 14:41:13 PASSED

This test (401549356285) was completed on the 16 September 2006 14:41:13 and PASSED the requirements for a valid MOT with 0 comments.

This test (401549356285) was completed on the 16 September 2006 14:41:13 and PASSED the requirements for a valid MOT with 0 comments.

Recorded mileage: 11,811

Recorded mileage: 11,811


MOT TEST: 08 September 2006 17:12:35 FAILED
MOT TEST: 08 September 2006 17:12:35 FAILED

This test (754981656261) was completed on the 08 September 2006 17:12:35 and FAILED the requirements for a valid MOT with 4 comments.

This test (754981656261) was completed on the 08 September 2006 17:12:35 and FAILED the requirements for a valid MOT with 4 comments.

Recorded mileage: 11,811

Recorded mileage: 11,811


FAIL