243 UXF


243UXF is registered to a Orange 1963, Morris Mini minor with a Petrol engine. It Failed its most recent MOT Test on the 12 May 2018

1 unique faults (1 Total) reported in its MOT History (10 Tests).

0 common/recurring faults.

90% (9) MOT Pass Rate and a 10% (1) MOT Failure Rate.

2,532 recorded miles.

243 UXF


243UXF is registered to a Orange 1963, Morris Mini minor with a Petrol engine. It Failed its most recent MOT Test on the 12 May 2018

1 unique faults (1 Total) reported in its MOT History (10 Tests).

0 common/recurring faults.

90% (9) MOT Pass Rate and a 10% (1) MOT Failure Rate.

2,532 recorded miles.

MOT PASS/Failure rate for 243 UXF

all MOT test results for 243 UXF represented as a percentage
MOT PASS/Failure rate for 243 UXF
all MOT test results for 243 UXF represented as a percentage

PERCENTAGE OF VEHICLE FAULTS WITH 243 UXF

ALL REPORTED FAULTS, DISPLAYED BY PERCENTAGE OF OCCURRENCE DURING ALL MOT TESTS
PERCENTAGE OF VEHICLE FAULTS WITH 243 UXF
ALL REPORTED FAULTS, DISPLAYED BY PERCENTAGE OF OCCURRENCE DURING ALL MOT TESTS
PASS WITH RECTIFICATION

243 UXF annual Faults by type

ALL REPORTED FAULTS, DISPLAYED over time and categorised by type
243 UXF annual Faults by type
ALL REPORTED FAULTS, DISPLAYED over time and categorised by type

ALL 243 UXF Pass With Rectification Faults [1]

ALL Pass With Rectification faults, ORDERED by OCCURRENCE DURING 243 UXF's MOT HISTORY
ALL 243 UXF Pass With Rectification Faults [1]
ALL Pass With Rectification faults, ORDERED by OCCURRENCE DURING 243 UXF's MOT HISTORY
Pass With Rectification Faults | source www.vehiclestats.co.uk
Fault Fault Test Date Test Date/Time Reference MOT Test Reference
1 Nearside rear rear position lamp(s) not working (1.1.a.3b) Nearside rear rear position lamp(s) not working (1.1.a.3b) 25 July 2014 [17:11] 25/07/2014 195886304288 195886304288

MOT TEST: 12 May 2018 08:36:55 PASSED
MOT TEST: 12 May 2018 08:36:55 PASSED

This test (249129357172) was completed on the 12 May 2018 08:36:55 and PASSED the requirements for a valid MOT with 0 comments.

This test (249129357172) was completed on the 12 May 2018 08:36:55 and PASSED the requirements for a valid MOT with 0 comments.

Recorded mileage: 2,532

Recorded mileage: 2,532


MOT TEST: 17 May 2017 09:52:18 PASSED
MOT TEST: 17 May 2017 09:52:18 PASSED

This test (682518190879) was completed on the 17 May 2017 09:52:18 and PASSED the requirements for a valid MOT with 0 comments.

This test (682518190879) was completed on the 17 May 2017 09:52:18 and PASSED the requirements for a valid MOT with 0 comments.

Recorded mileage: 2,444

Recorded mileage: 2,444


MOT TEST: 04 May 2016 09:17:10 PASSED
MOT TEST: 04 May 2016 09:17:10 PASSED

This test (519278481764) was completed on the 04 May 2016 09:17:10 and PASSED the requirements for a valid MOT with 0 comments.

This test (519278481764) was completed on the 04 May 2016 09:17:10 and PASSED the requirements for a valid MOT with 0 comments.

Recorded mileage: 2,001

Recorded mileage: 2,001


MOT TEST: 25 July 2014 17:11:50 PASSED
MOT TEST: 25 July 2014 17:11:50 PASSED

This test (526766004279) was completed on the 25 July 2014 17:11:50 and PASSED the requirements for a valid MOT with 0 comments.

This test (526766004279) was completed on the 25 July 2014 17:11:50 and PASSED the requirements for a valid MOT with 0 comments.

Recorded mileage: 1,659

Recorded mileage: 1,659


MOT TEST: 25 July 2014 17:11:50 FAILED
MOT TEST: 25 July 2014 17:11:50 FAILED

This test (195886304288) was completed on the 25 July 2014 17:11:50 and FAILED the requirements for a valid MOT with 1 comments.

This test (195886304288) was completed on the 25 July 2014 17:11:50 and FAILED the requirements for a valid MOT with 1 comments.

Recorded mileage: 1,659

Recorded mileage: 1,659


PASS WITH RECTIFICATION


MOT TEST: 10 April 2013 15:24:44 PASSED
MOT TEST: 10 April 2013 15:24:44 PASSED

This test (155920803199) was completed on the 10 April 2013 15:24:44 and PASSED the requirements for a valid MOT with 0 comments.

This test (155920803199) was completed on the 10 April 2013 15:24:44 and PASSED the requirements for a valid MOT with 0 comments.

Recorded mileage: 1,331

Recorded mileage: 1,331


MOT TEST: 13 January 2012 13:14:24 PASSED
MOT TEST: 13 January 2012 13:14:24 PASSED

This test (179183212013) was completed on the 13 January 2012 13:14:24 and PASSED the requirements for a valid MOT with 0 comments.

This test (179183212013) was completed on the 13 January 2012 13:14:24 and PASSED the requirements for a valid MOT with 0 comments.

Recorded mileage: 0

Recorded mileage: 0


MOT TEST: 23 March 2011 16:28:55 PASSED
MOT TEST: 23 March 2011 16:28:55 PASSED

This test (869872881074) was completed on the 23 March 2011 16:28:55 and PASSED the requirements for a valid MOT with 0 comments.

This test (869872881074) was completed on the 23 March 2011 16:28:55 and PASSED the requirements for a valid MOT with 0 comments.

Recorded mileage: 0

Recorded mileage: 0


MOT TEST: 17 March 2010 16:44:51 PASSED
MOT TEST: 17 March 2010 16:44:51 PASSED

This test (794816870086) was completed on the 17 March 2010 16:44:51 and PASSED the requirements for a valid MOT with 0 comments.

This test (794816870086) was completed on the 17 March 2010 16:44:51 and PASSED the requirements for a valid MOT with 0 comments.

Recorded mileage: 0

Recorded mileage: 0


MOT TEST: 21 March 2009 13:32:23 PASSED
MOT TEST: 21 March 2009 13:32:23 PASSED

This test (153240689475) was completed on the 21 March 2009 13:32:23 and PASSED the requirements for a valid MOT with 0 comments.

This test (153240689475) was completed on the 21 March 2009 13:32:23 and PASSED the requirements for a valid MOT with 0 comments.

Recorded mileage: 0

Recorded mileage: 0