244 LHY


244LHY is registered to a Black 1961, Morris Minor 1000 with a Petrol engine. It Passed its most recent MOT Test on the 20 March 2019

15 unique faults (15 Total) reported in its MOT History (7 Tests).

0 common/recurring faults.

71% (5) MOT Pass Rate and a 29% (2) MOT Failure Rate.

77,173 recorded miles.

244 LHY


244LHY is registered to a Black 1961, Morris Minor 1000 with a Petrol engine. It Passed its most recent MOT Test on the 20 March 2019

15 unique faults (15 Total) reported in its MOT History (7 Tests).

0 common/recurring faults.

71% (5) MOT Pass Rate and a 29% (2) MOT Failure Rate.

77,173 recorded miles.

MOT PASS/Failure rate for 244 LHY

all MOT test results for 244 LHY represented as a percentage
MOT PASS/Failure rate for 244 LHY
all MOT test results for 244 LHY represented as a percentage

PERCENTAGE OF VEHICLE FAULTS WITH 244 LHY

ALL REPORTED FAULTS, DISPLAYED BY PERCENTAGE OF OCCURRENCE DURING ALL MOT TESTS
PERCENTAGE OF VEHICLE FAULTS WITH 244 LHY
ALL REPORTED FAULTS, DISPLAYED BY PERCENTAGE OF OCCURRENCE DURING ALL MOT TESTS
ADVISORY

FAIL

PASS WITH RECTIFICATION

244 LHY annual Faults by type

ALL REPORTED FAULTS, DISPLAYED over time and categorised by type
244 LHY annual Faults by type
ALL REPORTED FAULTS, DISPLAYED over time and categorised by type

ALL 244 LHY ADVISORIES [4]

ALL ADVISORIES, ORDERED by OCCURRENCE DURING 244 LHY's MOT HISTORY
ALL 244 LHY ADVISORIES [4]
ALL ADVISORIES, ORDERED by OCCURRENCE DURING 244 LHY's MOT HISTORY
Fail Faults | source www.vehiclestats.co.uk
Fault Fault Test Date Test Date/Time Reference MOT Test Reference
1 Exhaust manifold fixing nut missing. Exhaust manifold fixing nut missing. 20 March 2019 [09:19] 20/03/2019 252931876205 252931876205
1 Engine oil level excessive low. Engine oil level excessive low. 20 March 2019 [09:19] 20/03/2019 252931876205 252931876205
1 Reverse light not working. Reverse light not working. 20 March 2019 [09:19] 20/03/2019 252931876205 252931876205
1 Engine oil level excessively low. Engine oil level excessively low. 07 October 2016 [09:36] 07/10/2016 228209309050 228209309050

ALL 244 LHY Failure Faults [9]

ALL Failure faults, ORDERED by OCCURRENCE DURING 244 LHY's MOT HISTORY
ALL 244 LHY Failure Faults [9]
ALL Failure faults, ORDERED by OCCURRENCE DURING 244 LHY's MOT HISTORY
Fail Faults | source www.vehiclestats.co.uk
Fault Fault Test Date Test Date/Time Reference MOT Test Reference
1 Fuel cap/sealing device ineffective (6.1.3 (b) (i)) Fuel cap/sealing device ineffective (6.1.3 (b) (i)) 20 March 2019 [09:19] 20/03/2019 252931876205 252931876205
1 Brake hydraulic reservoir fluid level significantly below minimum level (1.1.10 (d) (ii)) Brake hydraulic reservoir fluid level significantly below minimum level (1.1.10 (d) (ii)) 20 March 2019 [09:19] 20/03/2019 252931876205 252931876205
1 Parking brake efficiency below requirements (1.4.2 (a) (i)) Parking brake efficiency below requirements (1.4.2 (a) (i)) 20 March 2019 [09:19] 20/03/2019 252931876205 252931876205
1 Nearside front all position lamps not working (1.1.a.3b) Nearside front all position lamps not working (1.1.a.3b) 11 October 2017 [08:20] 11/10/2017 120719463670 120719463670
1 Offside front all position lamps not working (1.1.a.3b) Offside front all position lamps not working (1.1.a.3b) 11 October 2017 [08:20] 11/10/2017 120719463670 120719463670
1 Nearside rear all position lamps not working (1.1.a.3b) Nearside rear all position lamps not working (1.1.a.3b) 11 October 2017 [08:20] 11/10/2017 120719463670 120719463670
1 Offside rear all position lamps not working (1.1.a.3b) Offside rear all position lamps not working (1.1.a.3b) 11 October 2017 [08:20] 11/10/2017 120719463670 120719463670
1 Nearside steering rack gaiter split (2.2.d.2d) Nearside steering rack gaiter split (2.2.d.2d) 11 October 2017 [08:20] 11/10/2017 120719463670 120719463670
1 Offside steering rack gaiter split (2.2.d.2d) Offside steering rack gaiter split (2.2.d.2d) 11 October 2017 [08:20] 11/10/2017 120719463670 120719463670

ALL 244 LHY Pass With Rectification Faults [2]

ALL Pass With Rectification faults, ORDERED by OCCURRENCE DURING 244 LHY's MOT HISTORY
ALL 244 LHY Pass With Rectification Faults [2]
ALL Pass With Rectification faults, ORDERED by OCCURRENCE DURING 244 LHY's MOT HISTORY
Fail Faults | source www.vehiclestats.co.uk
Fault Fault Test Date Test Date/Time Reference MOT Test Reference
1 Nearside windscreen washer provides insufficient washer liquid (3.5 (a)) Nearside windscreen washer provides insufficient washer liquid (3.5 (a)) 20 March 2019 [09:19] 20/03/2019 252931876205 252931876205
1 Offside windscreen washer provides insufficient washer liquid (3.5 (a)) Offside windscreen washer provides insufficient washer liquid (3.5 (a)) 20 March 2019 [09:19] 20/03/2019 252931876205 252931876205

MOT TEST: 20 March 2019 12:52:30 PASSED
MOT TEST: 20 March 2019 12:52:30 PASSED

This test (349955541586) was completed on the 20 March 2019 12:52:30 and PASSED the requirements for a valid MOT with 0 comments.

This test (349955541586) was completed on the 20 March 2019 12:52:30 and PASSED the requirements for a valid MOT with 0 comments.

Recorded mileage: 63,821

Recorded mileage: 63,821


MOT TEST: 20 March 2019 09:19:38 FAILED
MOT TEST: 20 March 2019 09:19:38 FAILED

This test (252931876205) was completed on the 20 March 2019 09:19:38 and FAILED the requirements for a valid MOT with 8 comments.

This test (252931876205) was completed on the 20 March 2019 09:19:38 and FAILED the requirements for a valid MOT with 8 comments.

Recorded mileage: 63,821

Recorded mileage: 63,821


ADVISORY

FAIL

PASS WITH RECTIFICATION


MOT TEST: 17 October 2017 12:10:26 PASSED
MOT TEST: 17 October 2017 12:10:26 PASSED

This test (815871391270) was completed on the 17 October 2017 12:10:26 and PASSED the requirements for a valid MOT with 0 comments.

This test (815871391270) was completed on the 17 October 2017 12:10:26 and PASSED the requirements for a valid MOT with 0 comments.

Recorded mileage: 40,335

Recorded mileage: 40,335


MOT TEST: 11 October 2017 08:20:45 FAILED
MOT TEST: 11 October 2017 08:20:45 FAILED

This test (120719463670) was completed on the 11 October 2017 08:20:45 and FAILED the requirements for a valid MOT with 6 comments.

This test (120719463670) was completed on the 11 October 2017 08:20:45 and FAILED the requirements for a valid MOT with 6 comments.

Recorded mileage: 40,335

Recorded mileage: 40,335


FAIL


MOT TEST: 07 October 2016 09:36:40 PASSED
MOT TEST: 07 October 2016 09:36:40 PASSED

This test (228209309050) was completed on the 07 October 2016 09:36:40 and PASSED the requirements for a valid MOT with 1 comments.

This test (228209309050) was completed on the 07 October 2016 09:36:40 and PASSED the requirements for a valid MOT with 1 comments.

Recorded mileage: 21,351

Recorded mileage: 21,351


ADVISORY


MOT TEST: 08 October 2014 09:36:36 PASSED
MOT TEST: 08 October 2014 09:36:36 PASSED

This test (347751684283) was completed on the 08 October 2014 09:36:36 and PASSED the requirements for a valid MOT with 0 comments.

This test (347751684283) was completed on the 08 October 2014 09:36:36 and PASSED the requirements for a valid MOT with 0 comments.

Recorded mileage: 77,173

Recorded mileage: 77,173


MOT TEST: 18 September 2013 17:03:09 PASSED
MOT TEST: 18 September 2013 17:03:09 PASSED

This test (166151363255) was completed on the 18 September 2013 17:03:09 and PASSED the requirements for a valid MOT with 0 comments.

This test (166151363255) was completed on the 18 September 2013 17:03:09 and PASSED the requirements for a valid MOT with 0 comments.

Recorded mileage: 77,171

Recorded mileage: 77,171