252 LMM


252LMM is registered to a Red 1949, Morris Minor with a Petrol engine. It Failed its most recent MOT Test on the 01 June 2017

11 unique faults (13 Total) reported in its MOT History (10 Tests).

2 common/recurring faults, the most frequent (2 times) is: n/s/r shock absorber link to chassis locking device missing.

70% (7) MOT Pass Rate and a 30% (3) MOT Failure Rate.

44,368 recorded miles.

252 LMM


252LMM is registered to a Red 1949, Morris Minor with a Petrol engine. It Failed its most recent MOT Test on the 01 June 2017

11 unique faults (13 Total) reported in its MOT History (10 Tests).

2 common/recurring faults, the most frequent (2 times) is: n/s/r shock absorber link to chassis locking device missing.

70% (7) MOT Pass Rate and a 30% (3) MOT Failure Rate.

44,368 recorded miles.

MOT PASS/Failure rate for 252 LMM

all MOT test results for 252 LMM represented as a percentage
MOT PASS/Failure rate for 252 LMM
all MOT test results for 252 LMM represented as a percentage

PERCENTAGE OF VEHICLE FAULTS WITH 252 LMM

ALL REPORTED FAULTS, DISPLAYED BY PERCENTAGE OF OCCURRENCE DURING ALL MOT TESTS
PERCENTAGE OF VEHICLE FAULTS WITH 252 LMM
ALL REPORTED FAULTS, DISPLAYED BY PERCENTAGE OF OCCURRENCE DURING ALL MOT TESTS
ADVISORY

FAIL

USER ENTERED

252 LMM annual Faults by type

ALL REPORTED FAULTS, DISPLAYED over time and categorised by type
252 LMM annual Faults by type
ALL REPORTED FAULTS, DISPLAYED over time and categorised by type

RECURRING FAULTS WITH 252 LMM

FAULTS THAT HAVE OCCURED MORE THAN ONCE DURING 252 LMM's MOT HISTORY
RECURRING FAULTS WITH 252 LMM
FAULTS THAT HAVE OCCURED MORE THAN ONCE DURING 252 LMM's MOT HISTORY
Fault Fault Test Date Test Date/Time Reference MOT Test Reference
2 N/s/r shock absorber link to chassis locking device missing N/s/r shock absorber link to chassis locking device missing 19 June 2009 [13:15] 19/06/2009 19 June 2009 [12:59] 19/06/2009 280100679162 280100679162 444170779111 444170779111
2 O/s/r shock absorber link to chassis locking device missing O/s/r shock absorber link to chassis locking device missing 19 June 2009 [13:15] 19/06/2009 19 June 2009 [12:59] 19/06/2009 280100679162 280100679162 444170779111 444170779111

ALL 252 LMM ADVISORIES [1]

ALL ADVISORIES, ORDERED by OCCURRENCE DURING 252 LMM's MOT HISTORY
ALL 252 LMM ADVISORIES [1]
ALL ADVISORIES, ORDERED by OCCURRENCE DURING 252 LMM's MOT HISTORY
Fail Faults | source www.vehiclestats.co.uk
Fault Fault Test Date Test Date/Time Reference MOT Test Reference
1 Nearside rear service brake: service brake efficiency only just met. It would appear that the braking system requires adjustment or repair. (3.7.b.7) Nearside rear service brake: service brake efficiency only just met. It would appear that the braking system requires adjustment or repair. (3.7.b.7) 16 June 2011 [10:28] 16/06/2011 635067061123 635067061123

ALL 252 LMM Failure Faults [7]

ALL Failure faults, ORDERED by OCCURRENCE DURING 252 LMM's MOT HISTORY
ALL 252 LMM Failure Faults [7]
ALL Failure faults, ORDERED by OCCURRENCE DURING 252 LMM's MOT HISTORY
Fail Faults | source www.vehiclestats.co.uk
Fault Fault Test Date Test Date/Time Reference MOT Test Reference
1 Offside front front brake binding (3.7.b.1) Offside front front brake binding (3.7.b.1) 02 June 2014 [09:39] 02/06/2014 666793554193 666793554193
1 Nearside front track rod end ball joint dust cover excessively damaged so that it no longer prevents the ingress of dirt (2.2.c.1c) Nearside front track rod end ball joint dust cover excessively damaged so that it no longer prevents the ingress of dirt (2.2.c.1c) 02 June 2014 [09:39] 02/06/2014 666793554193 666793554193
1 Offside front track rod end ball joint dust cover excessively damaged so that it no longer prevents the ingress of dirt (2.2.c.1c) Offside front track rod end ball joint dust cover excessively damaged so that it no longer prevents the ingress of dirt (2.2.c.1c) 02 June 2014 [09:39] 02/06/2014 666793554193 666793554193
1 Nearside rear braking system leaking (3.6.a.1) Nearside rear braking system leaking (3.6.a.1) 02 June 2014 [09:39] 02/06/2014 666793554193 666793554193
1 Rear exhaust system not adequately supported (7.1.1) Rear exhaust system not adequately supported (7.1.1) 16 June 2011 [10:28] 16/06/2011 635067061123 635067061123
1 Offside rear leaf spring shackle pin locking device missing (2.4.b.3b) Offside rear leaf spring shackle pin locking device missing (2.4.b.3b) 19 June 2009 [12:59] 19/06/2009 444170779111 444170779111
1 Nearside rear leaf spring shackle pin locking device missing (2.4.b.3b) Nearside rear leaf spring shackle pin locking device missing (2.4.b.3b) 19 June 2009 [12:59] 19/06/2009 444170779111 444170779111

ALL 252 LMM User Entered Faults [5]

ALL User Entered faults, ORDERED by OCCURRENCE DURING 252 LMM's MOT HISTORY
ALL 252 LMM User Entered Faults [5]
ALL User Entered faults, ORDERED by OCCURRENCE DURING 252 LMM's MOT HISTORY
User Entered Faults | source www.vehiclestats.co.uk
Fault Fault Test Date Test Date/Time Reference MOT Test Reference
2 N/s/r shock absorber link to chassis locking device missing N/s/r shock absorber link to chassis locking device missing 19 June 2009 [13:15] 19/06/2009 19 June 2009 [12:59] 19/06/2009 280100679162 280100679162 444170779111 444170779111
2 O/s/r shock absorber link to chassis locking device missing O/s/r shock absorber link to chassis locking device missing 19 June 2009 [13:15] 19/06/2009 19 June 2009 [12:59] 19/06/2009 280100679162 280100679162 444170779111 444170779111
1 Oil leak Oil leak 19 June 2009 [13:15] 19/06/2009 280100679162 280100679162

MOT TEST: 01 June 2017 13:30:16 PASSED
MOT TEST: 01 June 2017 13:30:16 PASSED

This test (525698392492) was completed on the 01 June 2017 13:30:16 and PASSED the requirements for a valid MOT with 0 comments.

This test (525698392492) was completed on the 01 June 2017 13:30:16 and PASSED the requirements for a valid MOT with 0 comments.

Recorded mileage: 44,368

Recorded mileage: 44,368


MOT TEST: 11 June 2014 08:34:24 PASSED
MOT TEST: 11 June 2014 08:34:24 PASSED

This test (207892164160) was completed on the 11 June 2014 08:34:24 and PASSED the requirements for a valid MOT with 0 comments.

This test (207892164160) was completed on the 11 June 2014 08:34:24 and PASSED the requirements for a valid MOT with 0 comments.

Recorded mileage: 43,441

Recorded mileage: 43,441


MOT TEST: 02 June 2014 09:39:07 FAILED
MOT TEST: 02 June 2014 09:39:07 FAILED

This test (666793554193) was completed on the 02 June 2014 09:39:07 and FAILED the requirements for a valid MOT with 4 comments.

This test (666793554193) was completed on the 02 June 2014 09:39:07 and FAILED the requirements for a valid MOT with 4 comments.

Recorded mileage: 43,440

Recorded mileage: 43,440


FAIL


MOT TEST: 04 July 2013 12:42:35 PASSED
MOT TEST: 04 July 2013 12:42:35 PASSED

This test (969375283150) was completed on the 04 July 2013 12:42:35 and PASSED the requirements for a valid MOT with 0 comments.

This test (969375283150) was completed on the 04 July 2013 12:42:35 and PASSED the requirements for a valid MOT with 0 comments.

Recorded mileage: 42,985

Recorded mileage: 42,985


MOT TEST: 26 June 2012 15:11:30 PASSED
MOT TEST: 26 June 2012 15:11:30 PASSED

This test (409938072194) was completed on the 26 June 2012 15:11:30 and PASSED the requirements for a valid MOT with 0 comments.

This test (409938072194) was completed on the 26 June 2012 15:11:30 and PASSED the requirements for a valid MOT with 0 comments.

Recorded mileage: 42,407

Recorded mileage: 42,407


MOT TEST: 21 June 2011 14:50:56 PASSED
MOT TEST: 21 June 2011 14:50:56 PASSED

This test (938982571132) was completed on the 21 June 2011 14:50:56 and PASSED the requirements for a valid MOT with 0 comments.

This test (938982571132) was completed on the 21 June 2011 14:50:56 and PASSED the requirements for a valid MOT with 0 comments.

Recorded mileage: 41,822

Recorded mileage: 41,822


MOT TEST: 16 June 2011 10:28:10 FAILED
MOT TEST: 16 June 2011 10:28:10 FAILED

This test (635067061123) was completed on the 16 June 2011 10:28:10 and FAILED the requirements for a valid MOT with 2 comments.

This test (635067061123) was completed on the 16 June 2011 10:28:10 and FAILED the requirements for a valid MOT with 2 comments.

Recorded mileage: 41,822

Recorded mileage: 41,822


ADVISORY

FAIL


MOT TEST: 19 June 2009 13:15:20 PASSED
MOT TEST: 19 June 2009 13:15:20 PASSED

This test (280100679162) was completed on the 19 June 2009 13:15:20 and PASSED the requirements for a valid MOT with 3 comments.

This test (280100679162) was completed on the 19 June 2009 13:15:20 and PASSED the requirements for a valid MOT with 3 comments.

Recorded mileage: 40,623

Recorded mileage: 40,623


USER ENTERED


MOT TEST: 19 June 2009 12:59:08 FAILED
MOT TEST: 19 June 2009 12:59:08 FAILED

This test (444170779111) was completed on the 19 June 2009 12:59:08 and FAILED the requirements for a valid MOT with 4 comments.

This test (444170779111) was completed on the 19 June 2009 12:59:08 and FAILED the requirements for a valid MOT with 4 comments.

Recorded mileage: 40,623

Recorded mileage: 40,623


FAIL

USER ENTERED


MOT TEST: 20 March 2008 12:46:41 PASSED
MOT TEST: 20 March 2008 12:46:41 PASSED

This test (140550188079) was completed on the 20 March 2008 12:46:41 and PASSED the requirements for a valid MOT with 0 comments.

This test (140550188079) was completed on the 20 March 2008 12:46:41 and PASSED the requirements for a valid MOT with 0 comments.

Recorded mileage: 40,219

Recorded mileage: 40,219