254 UXW


254UXW is registered to a Black 1958, Morris Minor with a Petrol engine. It Failed its most recent MOT Test on the 24 March 2007

3 unique faults (3 Total) reported in its MOT History (3 Tests).

0 common/recurring faults.

67% (2) MOT Pass Rate and a 33% (1) MOT Failure Rate.

12,089 recorded miles.

254 UXW


254UXW is registered to a Black 1958, Morris Minor with a Petrol engine. It Failed its most recent MOT Test on the 24 March 2007

3 unique faults (3 Total) reported in its MOT History (3 Tests).

0 common/recurring faults.

67% (2) MOT Pass Rate and a 33% (1) MOT Failure Rate.

12,089 recorded miles.

MOT PASS/Failure rate for 254 UXW

all MOT test results for 254 UXW represented as a percentage
MOT PASS/Failure rate for 254 UXW
all MOT test results for 254 UXW represented as a percentage

PERCENTAGE OF VEHICLE FAULTS WITH 254 UXW

ALL REPORTED FAULTS, DISPLAYED BY PERCENTAGE OF OCCURRENCE DURING ALL MOT TESTS
PERCENTAGE OF VEHICLE FAULTS WITH 254 UXW
ALL REPORTED FAULTS, DISPLAYED BY PERCENTAGE OF OCCURRENCE DURING ALL MOT TESTS
PASS WITH RECTIFICATION

254 UXW annual Faults by type

ALL REPORTED FAULTS, DISPLAYED over time and categorised by type
254 UXW annual Faults by type
ALL REPORTED FAULTS, DISPLAYED over time and categorised by type

ALL 254 UXW Pass With Rectification Faults [3]

ALL Pass With Rectification faults, ORDERED by OCCURRENCE DURING 254 UXW's MOT HISTORY
ALL 254 UXW Pass With Rectification Faults [3]
ALL Pass With Rectification faults, ORDERED by OCCURRENCE DURING 254 UXW's MOT HISTORY
Pass With Rectification Faults | source www.vehiclestats.co.uk
Fault Fault Test Date Test Date/Time Reference MOT Test Reference
1 Nearside rear position lamp(s) excessively deteriorated so that it is not visible from a reasonable distance (1.1.a.3d) Nearside rear position lamp(s) excessively deteriorated so that it is not visible from a reasonable distance (1.1.a.3d) 24 March 2007 [11:02] 24/03/2007 773303787010 773303787010
1 Nearside stop lamp not working (1.2.1b) Nearside stop lamp not working (1.2.1b) 24 March 2007 [11:02] 24/03/2007 773303787010 773303787010
1 Nearside rear direction indicator not working (1.4.a.2c) Nearside rear direction indicator not working (1.4.a.2c) 24 March 2007 [11:02] 24/03/2007 773303787010 773303787010

MOT TEST: 24 March 2007 11:02:07 PASSED
MOT TEST: 24 March 2007 11:02:07 PASSED

This test (100183987487) was completed on the 24 March 2007 11:02:07 and PASSED the requirements for a valid MOT with 0 comments.

This test (100183987487) was completed on the 24 March 2007 11:02:07 and PASSED the requirements for a valid MOT with 0 comments.

Recorded mileage: 12,089

Recorded mileage: 12,089


MOT TEST: 24 March 2007 11:02:07 FAILED
MOT TEST: 24 March 2007 11:02:07 FAILED

This test (773303787010) was completed on the 24 March 2007 11:02:07 and FAILED the requirements for a valid MOT with 3 comments.

This test (773303787010) was completed on the 24 March 2007 11:02:07 and FAILED the requirements for a valid MOT with 3 comments.

Recorded mileage: 12,089

Recorded mileage: 12,089


PASS WITH RECTIFICATION


MOT TEST: 25 March 2006 10:43:24 PASSED
MOT TEST: 25 March 2006 10:43:24 PASSED

This test (733154686096) was completed on the 25 March 2006 10:43:24 and PASSED the requirements for a valid MOT with 0 comments.

This test (733154686096) was completed on the 25 March 2006 10:43:24 and PASSED the requirements for a valid MOT with 0 comments.

Recorded mileage: 11,669

Recorded mileage: 11,669