261 UXE


261UXE is registered to a White 1971, Morris 1000 with a Petrol engine. It Failed its most recent MOT Test on the 17 June 2013

35 unique faults (41 Total) reported in its MOT History (7 Tests).

5 common/recurring faults, the most frequent (2 times) is: Windscreen washer provides insufficient washer liquid (8.2.3).

43% (3) MOT Pass Rate and a 57% (4) MOT Failure Rate.

63,935 recorded miles.

261 UXE


261UXE is registered to a White 1971, Morris 1000 with a Petrol engine. It Failed its most recent MOT Test on the 17 June 2013

35 unique faults (41 Total) reported in its MOT History (7 Tests).

5 common/recurring faults, the most frequent (2 times) is: Windscreen washer provides insufficient washer liquid (8.2.3).

43% (3) MOT Pass Rate and a 57% (4) MOT Failure Rate.

63,935 recorded miles.

MOT PASS/Failure rate for 261 UXE

all MOT test results for 261 UXE represented as a percentage
MOT PASS/Failure rate for 261 UXE
all MOT test results for 261 UXE represented as a percentage

PERCENTAGE OF VEHICLE FAULTS WITH 261 UXE

ALL REPORTED FAULTS, DISPLAYED BY PERCENTAGE OF OCCURRENCE DURING ALL MOT TESTS
PERCENTAGE OF VEHICLE FAULTS WITH 261 UXE
ALL REPORTED FAULTS, DISPLAYED BY PERCENTAGE OF OCCURRENCE DURING ALL MOT TESTS
ADVISORY

FAIL

USER ENTERED

261 UXE annual Faults by type

ALL REPORTED FAULTS, DISPLAYED over time and categorised by type
261 UXE annual Faults by type
ALL REPORTED FAULTS, DISPLAYED over time and categorised by type

RECURRING FAULTS WITH 261 UXE

FAULTS THAT HAVE OCCURED MORE THAN ONCE DURING 261 UXE's MOT HISTORY
RECURRING FAULTS WITH 261 UXE
FAULTS THAT HAVE OCCURED MORE THAN ONCE DURING 261 UXE's MOT HISTORY
Fault Fault Test Date Test Date/Time Reference MOT Test Reference
2 Windscreen washer provides insufficient washer liquid (8.2.3) Windscreen washer provides insufficient washer liquid (8.2.3) 17 June 2013 [10:43] 17/06/2013 01 September 2006 [09:07] 01/09/2006 407268863154 407268863154 782744346229 782744346229
2 Offside rear suspension spring mounting prescribed area is excessively corroded (2.4.a.3) Offside rear suspension spring mounting prescribed area is excessively corroded (2.4.a.3) 22 March 2012 [09:35] 22/03/2012 01 September 2006 [09:07] 01/09/2006 556142982022 556142982022 782744346229 782744346229
2 Offside front suspension component mounting prescribed area is excessively corroded (2.4.a.3) Offside front suspension component mounting prescribed area is excessively corroded (2.4.a.3) 22 March 2012 [09:35] 22/03/2012 01 September 2006 [09:07] 01/09/2006 556142982022 556142982022 782744346229 782744346229
2 Brakes imbalanced across an axle (3.7.b.5b) Brakes imbalanced across an axle (3.7.b.5b) 22 March 2012 [09:35] 22/03/2012 01 September 2006 [09:07] 01/09/2006 556142982022 556142982022 782744346229 782744346229
2 There are various repairs and corrosion under the car, but all repairs are sound and some repairs have been carried out on the inside of the structure There are various repairs and corrosion under the car, but all repairs are sound and some repairs have been carried out on the inside of the structure 12 November 2010 [10:14] 12/11/2010 10 November 2010 [14:49] 10/11/2010 200136410340 200136410340 240324010301 240324010301

ALL 261 UXE ADVISORIES [1]

ALL ADVISORIES, ORDERED by OCCURRENCE DURING 261 UXE's MOT HISTORY
ALL 261 UXE ADVISORIES [1]
ALL ADVISORIES, ORDERED by OCCURRENCE DURING 261 UXE's MOT HISTORY
Advisory Faults | source www.vehiclestats.co.uk
Fault Fault Test Date Test Date/Time Reference MOT Test Reference
1 Brakes imbalanced requirements only just met. It would appear that the braking system requires adjustment or repair. (3.7.b.5b) Brakes imbalanced requirements only just met. It would appear that the braking system requires adjustment or repair. (3.7.b.5b) 27 March 2012 [09:39] 27/03/2012 215317382055 215317382055

ALL 261 UXE Failure Faults [36]

ALL Failure faults, ORDERED by OCCURRENCE DURING 261 UXE's MOT HISTORY
ALL 261 UXE Failure Faults [36]
ALL Failure faults, ORDERED by OCCURRENCE DURING 261 UXE's MOT HISTORY
Fail Faults | source www.vehiclestats.co.uk
Fault Fault Test Date Test Date/Time Reference MOT Test Reference
2 Windscreen washer provides insufficient washer liquid (8.2.3) Windscreen washer provides insufficient washer liquid (8.2.3) 17 June 2013 [10:43] 17/06/2013 01 September 2006 [09:07] 01/09/2006 407268863154 407268863154 782744346229 782744346229
2 Offside rear suspension spring mounting prescribed area is excessively corroded (2.4.a.3) Offside rear suspension spring mounting prescribed area is excessively corroded (2.4.a.3) 22 March 2012 [09:35] 22/03/2012 01 September 2006 [09:07] 01/09/2006 556142982022 556142982022 782744346229 782744346229
2 Offside front suspension component mounting prescribed area is excessively corroded (2.4.a.3) Offside front suspension component mounting prescribed area is excessively corroded (2.4.a.3) 22 March 2012 [09:35] 22/03/2012 01 September 2006 [09:07] 01/09/2006 556142982022 556142982022 782744346229 782744346229
2 Brakes imbalanced across an axle (3.7.b.5b) Brakes imbalanced across an axle (3.7.b.5b) 22 March 2012 [09:35] 22/03/2012 01 September 2006 [09:07] 01/09/2006 556142982022 556142982022 782744346229 782744346229
1 Horn not working (1.6.2a) Horn not working (1.6.2a) 17 June 2013 [10:43] 17/06/2013 407268863154 407268863154
1 Nearside rear brake cable has restricted free movement (3.5.1k) Nearside rear brake cable has restricted free movement (3.5.1k) 22 March 2012 [09:35] 22/03/2012 556142982022 556142982022
1 Service brake: efficiency below requirements (3.7.b.7) Service brake: efficiency below requirements (3.7.b.7) 22 March 2012 [09:35] 22/03/2012 556142982022 556142982022
1 Offside stop lamp not working (1.2.1b) Offside stop lamp not working (1.2.1b) 10 November 2010 [14:49] 10/11/2010 240324010301 240324010301
1 Offside rear position lamp(s) not working (1.1.a.3b) Offside rear position lamp(s) not working (1.1.a.3b) 10 November 2010 [14:49] 10/11/2010 240324010301 240324010301
1 Nearside registration plate lamp not working (1.1.c.1d) Nearside registration plate lamp not working (1.1.c.1d) 10 November 2010 [14:49] 10/11/2010 240324010301 240324010301
1 Nearside rear mechanical brake component has restricted free movement (3.5.1k) Nearside rear mechanical brake component has restricted free movement (3.5.1k) 10 November 2010 [14:49] 10/11/2010 240324010301 240324010301
1 Nearside front direction indicators not working (1.4.a.2c) Nearside front direction indicators not working (1.4.a.2c) 10 November 2010 [14:49] 10/11/2010 240324010301 240324010301
1 Offside front direction indicators not working (1.4.a.2c) Offside front direction indicators not working (1.4.a.2c) 10 November 2010 [14:49] 10/11/2010 240324010301 240324010301
1 Nearside rear direction indicators not working (1.4.a.2c) Nearside rear direction indicators not working (1.4.a.2c) 10 November 2010 [14:49] 10/11/2010 240324010301 240324010301
1 Offside rear direction indicators not working (1.4.a.2c) Offside rear direction indicators not working (1.4.a.2c) 10 November 2010 [14:49] 10/11/2010 240324010301 240324010301
1 Brake pedal spongy (3.3.b.1b) Brake pedal spongy (3.3.b.1b) 10 November 2010 [14:49] 10/11/2010 240324010301 240324010301
1 Service brake: efficiency below requirements (3.7.c.1a) Service brake: efficiency below requirements (3.7.c.1a) 10 November 2010 [14:49] 10/11/2010 240324010301 240324010301
1 Headlamp switch faulty (1.7.1) Headlamp switch faulty (1.7.1) 01 September 2006 [09:07] 01/09/2006 782744346229 782744346229
1 Offside drivers door does not latch securely closed (6.2.b.1a) Offside drivers door does not latch securely closed (6.2.b.1a) 01 September 2006 [09:07] 01/09/2006 782744346229 782744346229
1 Nearside registration plate lamp not working (1.1.5c) Nearside registration plate lamp not working (1.1.5c) 01 September 2006 [09:07] 01/09/2006 782744346229 782744346229
1 Nearside rear direction indicator not working (1.4.a.2c) Nearside rear direction indicator not working (1.4.a.2c) 01 September 2006 [09:07] 01/09/2006 782744346229 782744346229
1 Nearside stop lamp not working (1.2.1b) Nearside stop lamp not working (1.2.1b) 01 September 2006 [09:07] 01/09/2006 782744346229 782744346229
1 Offside suspension component mounting prescribed area is inadequately repaired (2.4.a.3) Offside suspension component mounting prescribed area is inadequately repaired (2.4.a.3) 01 September 2006 [09:07] 01/09/2006 782744346229 782744346229
1 Offside suspension component mounting prescribed area is excessively corroded (2.4.a.3) Offside suspension component mounting prescribed area is excessively corroded (2.4.a.3) 01 September 2006 [09:07] 01/09/2006 782744346229 782744346229
1 Nearside rear suspension component mounting prescribed area is excessively corroded (2.4.a.3) Nearside rear suspension component mounting prescribed area is excessively corroded (2.4.a.3) 01 September 2006 [09:07] 01/09/2006 782744346229 782744346229
1 Nearside front front suspension retaining device missing (2.5.a.4) Nearside front front suspension retaining device missing (2.5.a.4) 01 September 2006 [09:07] 01/09/2006 782744346229 782744346229
1 Offside front brake recording little or no effort (3.7.b.5a) Offside front brake recording little or no effort (3.7.b.5a) 01 September 2006 [09:07] 01/09/2006 782744346229 782744346229
1 Offside rear brake recording little or no effort (3.7.b.5a) Offside rear brake recording little or no effort (3.7.b.5a) 01 September 2006 [09:07] 01/09/2006 782744346229 782744346229
1 Rear brake application uneven (3.7.b.2) Rear brake application uneven (3.7.b.2) 01 September 2006 [09:07] 01/09/2006 782744346229 782744346229
1 Offside rear parking brake recording little or no effort (3.7.b.6a) Offside rear parking brake recording little or no effort (3.7.b.6a) 01 September 2006 [09:07] 01/09/2006 782744346229 782744346229
1 Parking brake: efficiency below requirements (3.7.b.7) Parking brake: efficiency below requirements (3.7.b.7) 01 September 2006 [09:07] 01/09/2006 782744346229 782744346229

ALL 261 UXE User Entered Faults [4]

ALL User Entered faults, ORDERED by OCCURRENCE DURING 261 UXE's MOT HISTORY
ALL 261 UXE User Entered Faults [4]
ALL User Entered faults, ORDERED by OCCURRENCE DURING 261 UXE's MOT HISTORY
User Entered Faults | source www.vehiclestats.co.uk
Fault Fault Test Date Test Date/Time Reference MOT Test Reference
2 There are various repairs and corrosion under the car, but all repairs are sound and some repairs have been carried out on the inside of the structure There are various repairs and corrosion under the car, but all repairs are sound and some repairs have been carried out on the inside of the structure 12 November 2010 [10:14] 12/11/2010 10 November 2010 [14:49] 10/11/2010 200136410340 200136410340 240324010301 240324010301
1 Slight smear on wipers Slight smear on wipers 12 November 2010 [10:14] 12/11/2010 200136410340 200136410340
1 Slight travel on foot brake Slight travel on foot brake 12 November 2010 [10:14] 12/11/2010 200136410340 200136410340

MOT TEST: 17 June 2013 16:06:30 PASSED
MOT TEST: 17 June 2013 16:06:30 PASSED

This test (605908563127) was completed on the 17 June 2013 16:06:30 and PASSED the requirements for a valid MOT with 0 comments.

This test (605908563127) was completed on the 17 June 2013 16:06:30 and PASSED the requirements for a valid MOT with 0 comments.

Recorded mileage: 63,935

Recorded mileage: 63,935


MOT TEST: 17 June 2013 10:43:05 FAILED
MOT TEST: 17 June 2013 10:43:05 FAILED

This test (407268863154) was completed on the 17 June 2013 10:43:05 and FAILED the requirements for a valid MOT with 2 comments.

This test (407268863154) was completed on the 17 June 2013 10:43:05 and FAILED the requirements for a valid MOT with 2 comments.

Recorded mileage: 63,933

Recorded mileage: 63,933


FAIL


MOT TEST: 27 March 2012 09:39:21 PASSED
MOT TEST: 27 March 2012 09:39:21 PASSED

This test (215317382055) was completed on the 27 March 2012 09:39:21 and PASSED the requirements for a valid MOT with 1 comments.

This test (215317382055) was completed on the 27 March 2012 09:39:21 and PASSED the requirements for a valid MOT with 1 comments.

Recorded mileage: 63,295

Recorded mileage: 63,295


ADVISORY


MOT TEST: 22 March 2012 09:35:44 FAILED
MOT TEST: 22 March 2012 09:35:44 FAILED

This test (556142982022) was completed on the 22 March 2012 09:35:44 and FAILED the requirements for a valid MOT with 5 comments.

This test (556142982022) was completed on the 22 March 2012 09:35:44 and FAILED the requirements for a valid MOT with 5 comments.

Recorded mileage: 63,295

Recorded mileage: 63,295


FAIL


MOT TEST: 12 November 2010 10:14:18 PASSED
MOT TEST: 12 November 2010 10:14:18 PASSED

This test (200136410340) was completed on the 12 November 2010 10:14:18 and PASSED the requirements for a valid MOT with 3 comments.

This test (200136410340) was completed on the 12 November 2010 10:14:18 and PASSED the requirements for a valid MOT with 3 comments.

Recorded mileage: 63,047

Recorded mileage: 63,047


USER ENTERED


MOT TEST: 10 November 2010 14:49:55 FAILED
MOT TEST: 10 November 2010 14:49:55 FAILED

This test (240324010301) was completed on the 10 November 2010 14:49:55 and FAILED the requirements for a valid MOT with 11 comments.

This test (240324010301) was completed on the 10 November 2010 14:49:55 and FAILED the requirements for a valid MOT with 11 comments.

Recorded mileage: 0

Recorded mileage: 0


FAIL

USER ENTERED


MOT TEST: 01 September 2006 09:07:22 FAILED
MOT TEST: 01 September 2006 09:07:22 FAILED

This test (782744346229) was completed on the 01 September 2006 09:07:22 and FAILED the requirements for a valid MOT with 19 comments.

This test (782744346229) was completed on the 01 September 2006 09:07:22 and FAILED the requirements for a valid MOT with 19 comments.

Recorded mileage: 0

Recorded mileage: 0


FAIL