262 LHW


262LHW is registered to a Grey 1961, Morris Minor with a Petrol engine. It Passed its most recent MOT Test on the 20 September 2018

24 unique faults (35 Total) reported in its MOT History (15 Tests).

7 common/recurring faults, the most frequent (3 times) is: Nearside Front Tyre worn close to the legal limit (4.1.E.1).

80% (12) MOT Pass Rate and a 20% (3) MOT Failure Rate.

31,784 recorded miles.

262 LHW


262LHW is registered to a Grey 1961, Morris Minor with a Petrol engine. It Passed its most recent MOT Test on the 20 September 2018

24 unique faults (35 Total) reported in its MOT History (15 Tests).

7 common/recurring faults, the most frequent (3 times) is: Nearside Front Tyre worn close to the legal limit (4.1.E.1).

80% (12) MOT Pass Rate and a 20% (3) MOT Failure Rate.

31,784 recorded miles.

MOT PASS/Failure rate for 262 LHW

all MOT test results for 262 LHW represented as a percentage
MOT PASS/Failure rate for 262 LHW
all MOT test results for 262 LHW represented as a percentage

PERCENTAGE OF VEHICLE FAULTS WITH 262 LHW

ALL REPORTED FAULTS, DISPLAYED BY PERCENTAGE OF OCCURRENCE DURING ALL MOT TESTS
PERCENTAGE OF VEHICLE FAULTS WITH 262 LHW
ALL REPORTED FAULTS, DISPLAYED BY PERCENTAGE OF OCCURRENCE DURING ALL MOT TESTS
ADVISORY

FAIL

PASS WITH RECTIFICATION

262 LHW annual Faults by type

ALL REPORTED FAULTS, DISPLAYED over time and categorised by type
262 LHW annual Faults by type
ALL REPORTED FAULTS, DISPLAYED over time and categorised by type

RECURRING FAULTS WITH 262 LHW

FAULTS THAT HAVE OCCURED MORE THAN ONCE DURING 262 LHW's MOT HISTORY
RECURRING FAULTS WITH 262 LHW
FAULTS THAT HAVE OCCURED MORE THAN ONCE DURING 262 LHW's MOT HISTORY
Fault Fault Test Date Test Date/Time Reference MOT Test Reference
3 Nearside front tyre worn close to the legal limit (4.1.e.1) Nearside front tyre worn close to the legal limit (4.1.e.1) 19 October 2017 [12:05] 19/10/2017 19 October 2017 [12:05] 19/10/2017 15 August 2017 [08:55] 15/08/2017 112474309698 112474309698 564364039594 564364039594 842923566115 842923566115
3 Offside front tyre worn close to the legal limit (4.1.e.1) Offside front tyre worn close to the legal limit (4.1.e.1) 19 October 2017 [12:05] 19/10/2017 19 October 2017 [12:05] 19/10/2017 15 August 2017 [08:55] 15/08/2017 112474309698 112474309698 564364039594 564364039594 842923566115 842923566115
3 Nearside rear tyre worn close to the legal limit (4.1.e.1) Nearside rear tyre worn close to the legal limit (4.1.e.1) 19 October 2017 [12:05] 19/10/2017 19 October 2017 [12:05] 19/10/2017 15 August 2017 [08:55] 15/08/2017 112474309698 112474309698 564364039594 564364039594 842923566115 842923566115
3 Offside rear tyre worn close to the legal limit (4.1.e.1) Offside rear tyre worn close to the legal limit (4.1.e.1) 19 October 2017 [12:05] 19/10/2017 19 October 2017 [12:05] 19/10/2017 15 August 2017 [08:55] 15/08/2017 112474309698 112474309698 564364039594 564364039594 842923566115 842923566115
2 Nearside front suspension pump stop missing Nearside front suspension pump stop missing 19 October 2017 [12:05] 19/10/2017 19 October 2017 [12:05] 19/10/2017 112474309698 112474309698 564364039594 564364039594
2 Offside front vehicle structure has slight corrosion outside 30cm from suspension / braking (6.1.b.2) Offside front vehicle structure has slight corrosion outside 30cm from suspension / braking (6.1.b.2) 19 October 2017 [12:05] 19/10/2017 19 October 2017 [12:05] 19/10/2017 112474309698 112474309698 564364039594 564364039594
2 Offside stop lamp not working (1.2.1b) Offside stop lamp not working (1.2.1b) 19 October 2017 [12:05] 19/10/2017 15 August 2017 [08:55] 15/08/2017 564364039594 564364039594 842923566115 842923566115

ALL 262 LHW ADVISORIES [18]

ALL ADVISORIES, ORDERED by OCCURRENCE DURING 262 LHW's MOT HISTORY
ALL 262 LHW ADVISORIES [18]
ALL ADVISORIES, ORDERED by OCCURRENCE DURING 262 LHW's MOT HISTORY
Advisory Faults | source www.vehiclestats.co.uk
Fault Fault Test Date Test Date/Time Reference MOT Test Reference
3 Nearside front tyre worn close to the legal limit (4.1.e.1) Nearside front tyre worn close to the legal limit (4.1.e.1) 19 October 2017 [12:05] 19/10/2017 19 October 2017 [12:05] 19/10/2017 15 August 2017 [08:55] 15/08/2017 112474309698 112474309698 564364039594 564364039594 842923566115 842923566115
3 Offside front tyre worn close to the legal limit (4.1.e.1) Offside front tyre worn close to the legal limit (4.1.e.1) 19 October 2017 [12:05] 19/10/2017 19 October 2017 [12:05] 19/10/2017 15 August 2017 [08:55] 15/08/2017 112474309698 112474309698 564364039594 564364039594 842923566115 842923566115
3 Nearside rear tyre worn close to the legal limit (4.1.e.1) Nearside rear tyre worn close to the legal limit (4.1.e.1) 19 October 2017 [12:05] 19/10/2017 19 October 2017 [12:05] 19/10/2017 15 August 2017 [08:55] 15/08/2017 112474309698 112474309698 564364039594 564364039594 842923566115 842923566115
3 Offside rear tyre worn close to the legal limit (4.1.e.1) Offside rear tyre worn close to the legal limit (4.1.e.1) 19 October 2017 [12:05] 19/10/2017 19 October 2017 [12:05] 19/10/2017 15 August 2017 [08:55] 15/08/2017 112474309698 112474309698 564364039594 564364039594 842923566115 842923566115
2 Nearside front suspension pump stop missing Nearside front suspension pump stop missing 19 October 2017 [12:05] 19/10/2017 19 October 2017 [12:05] 19/10/2017 112474309698 112474309698 564364039594 564364039594
2 Offside front vehicle structure has slight corrosion outside 30cm from suspension / braking (6.1.b.2) Offside front vehicle structure has slight corrosion outside 30cm from suspension / braking (6.1.b.2) 19 October 2017 [12:05] 19/10/2017 19 October 2017 [12:05] 19/10/2017 112474309698 112474309698 564364039594 564364039594
1 Nearside rear leaf spring has slight wear in a shackle pin and/or bush (5.3.4 (a) (i)) Nearside rear leaf spring has slight wear in a shackle pin and/or bush (5.3.4 (a) (i)) 18 September 2018 [14:46] 18/09/2018 717604100501 717604100501
1 Central exhaust silencer slightly loose (8.1.1 (b) (i)) Central exhaust silencer slightly loose (8.1.1 (b) (i)) 18 September 2018 [14:46] 18/09/2018 717604100501 717604100501

ALL 262 LHW Failure Faults [16]

ALL Failure faults, ORDERED by OCCURRENCE DURING 262 LHW's MOT HISTORY
ALL 262 LHW Failure Faults [16]
ALL Failure faults, ORDERED by OCCURRENCE DURING 262 LHW's MOT HISTORY
Fail Faults | source www.vehiclestats.co.uk
Fault Fault Test Date Test Date/Time Reference MOT Test Reference
1 Offside rear leaf spring shackle pin or bush excessively worn (5.3.4 (a) (i)) Offside rear leaf spring shackle pin or bush excessively worn (5.3.4 (a) (i)) 18 September 2018 [14:46] 18/09/2018 717604100501 717604100501
1 Rear exhaust system insecure (6.1.2 (a)) Rear exhaust system insecure (6.1.2 (a)) 18 September 2018 [14:46] 18/09/2018 717604100501 717604100501
1 Nearside headlamp aim too high (1.8) Nearside headlamp aim too high (1.8) 15 August 2017 [08:55] 15/08/2017 842923566115 842923566115
1 Offside headlamp aim too high (1.8) Offside headlamp aim too high (1.8) 15 August 2017 [08:55] 15/08/2017 842923566115 842923566115
1 Offside windscreen wiper does not clear the windscreen effectively (8.2.2) Offside windscreen wiper does not clear the windscreen effectively (8.2.2) 15 August 2017 [08:55] 15/08/2017 842923566115 842923566115
1 Offside semaphore indicator tell tale not working correctly (1.4.c.2) Offside semaphore indicator tell tale not working correctly (1.4.c.2) 15 August 2017 [08:55] 15/08/2017 842923566115 842923566115
1 Nearside semaphore indicator arm does not retract smoothly (1.4.c.1a) Nearside semaphore indicator arm does not retract smoothly (1.4.c.1a) 15 August 2017 [08:55] 15/08/2017 842923566115 842923566115
1 Offside stop lamp not working (1.2.1b) Offside stop lamp not working (1.2.1b) 15 August 2017 [08:55] 15/08/2017 842923566115 842923566115
1 Nearside stop lamp not working (1.2.1b) Nearside stop lamp not working (1.2.1b) 15 August 2017 [08:55] 15/08/2017 842923566115 842923566115
1 Rear position lamp(s) not working (1.1.a.3b) Rear position lamp(s) not working (1.1.a.3b) 15 August 2017 [08:55] 15/08/2017 842923566115 842923566115
1 Registration plate lamp not working (1.1.c.1d) Registration plate lamp not working (1.1.c.1d) 15 August 2017 [08:55] 15/08/2017 842923566115 842923566115
1 Nearside rear suspension spring mounting prescribed area is excessively corroded (2.4.a.3) Nearside rear suspension spring mounting prescribed area is excessively corroded (2.4.a.3) 15 August 2017 [08:55] 15/08/2017 842923566115 842923566115
1 Offside front lower suspension arm corroded and seriously weakened (2.4.g.1) Offside front lower suspension arm corroded and seriously weakened (2.4.g.1) 15 August 2017 [08:55] 15/08/2017 842923566115 842923566115
1 Nearside rear braking system leaking (3.6.a.1) Nearside rear braking system leaking (3.6.a.1) 15 August 2017 [08:55] 15/08/2017 842923566115 842923566115
1 Brake pedal does not operate a brake fitted to each wheel (3.3.a.3) Brake pedal does not operate a brake fitted to each wheel (3.3.a.3) 15 August 2017 [08:55] 15/08/2017 842923566115 842923566115
1 Brake performance not tested (3.7.a.1) Brake performance not tested (3.7.a.1) 15 August 2017 [08:55] 15/08/2017 842923566115 842923566115

ALL 262 LHW Pass With Rectification Faults [1]

ALL Pass With Rectification faults, ORDERED by OCCURRENCE DURING 262 LHW's MOT HISTORY
ALL 262 LHW Pass With Rectification Faults [1]
ALL Pass With Rectification faults, ORDERED by OCCURRENCE DURING 262 LHW's MOT HISTORY
Pass With Rectification Faults | source www.vehiclestats.co.uk
Fault Fault Test Date Test Date/Time Reference MOT Test Reference
1 Offside stop lamp not working (1.2.1b) Offside stop lamp not working (1.2.1b) 19 October 2017 [12:05] 19/10/2017 564364039594 564364039594

MOT TEST: 20 September 2018 14:29:21 PASSED
MOT TEST: 20 September 2018 14:29:21 PASSED

This test (416514331486) was completed on the 20 September 2018 14:29:21 and PASSED the requirements for a valid MOT with 0 comments.

This test (416514331486) was completed on the 20 September 2018 14:29:21 and PASSED the requirements for a valid MOT with 0 comments.

Recorded mileage: 31,784

Recorded mileage: 31,784


MOT TEST: 18 September 2018 14:46:25 FAILED
MOT TEST: 18 September 2018 14:46:25 FAILED

This test (717604100501) was completed on the 18 September 2018 14:46:25 and FAILED the requirements for a valid MOT with 4 comments.

This test (717604100501) was completed on the 18 September 2018 14:46:25 and FAILED the requirements for a valid MOT with 4 comments.

Recorded mileage: 31,768

Recorded mileage: 31,768


ADVISORY

FAIL


MOT TEST: 19 October 2017 12:05:52 PASSED
MOT TEST: 19 October 2017 12:05:52 PASSED

This test (112474309698) was completed on the 19 October 2017 12:05:52 and PASSED the requirements for a valid MOT with 6 comments.

This test (112474309698) was completed on the 19 October 2017 12:05:52 and PASSED the requirements for a valid MOT with 6 comments.

Recorded mileage: 31,666

Recorded mileage: 31,666


ADVISORY


MOT TEST: 19 October 2017 12:05:51 FAILED
MOT TEST: 19 October 2017 12:05:51 FAILED

This test (564364039594) was completed on the 19 October 2017 12:05:51 and FAILED the requirements for a valid MOT with 7 comments.

This test (564364039594) was completed on the 19 October 2017 12:05:51 and FAILED the requirements for a valid MOT with 7 comments.

Recorded mileage: 31,666

Recorded mileage: 31,666


ADVISORY

PASS WITH RECTIFICATION


MOT TEST: 15 August 2017 08:55:16 FAILED
MOT TEST: 15 August 2017 08:55:16 FAILED

This test (842923566115) was completed on the 15 August 2017 08:55:16 and FAILED the requirements for a valid MOT with 18 comments.

This test (842923566115) was completed on the 15 August 2017 08:55:16 and FAILED the requirements for a valid MOT with 18 comments.

Recorded mileage: 31,665

Recorded mileage: 31,665


ADVISORY

FAIL


MOT TEST: 23 January 2016 13:19:09 PASSED
MOT TEST: 23 January 2016 13:19:09 PASSED

This test (999858927163) was completed on the 23 January 2016 13:19:09 and PASSED the requirements for a valid MOT with 0 comments.

This test (999858927163) was completed on the 23 January 2016 13:19:09 and PASSED the requirements for a valid MOT with 0 comments.

Recorded mileage: 30,725

Recorded mileage: 30,725


MOT TEST: 24 January 2015 11:21:28 PASSED
MOT TEST: 24 January 2015 11:21:28 PASSED

This test (938854825099) was completed on the 24 January 2015 11:21:28 and PASSED the requirements for a valid MOT with 0 comments.

This test (938854825099) was completed on the 24 January 2015 11:21:28 and PASSED the requirements for a valid MOT with 0 comments.

Recorded mileage: 27,607

Recorded mileage: 27,607


MOT TEST: 11 January 2014 11:20:10 PASSED
MOT TEST: 11 January 2014 11:20:10 PASSED

This test (426741314084) was completed on the 11 January 2014 11:20:10 and PASSED the requirements for a valid MOT with 0 comments.

This test (426741314084) was completed on the 11 January 2014 11:20:10 and PASSED the requirements for a valid MOT with 0 comments.

Recorded mileage: 24,352

Recorded mileage: 24,352


MOT TEST: 28 January 2013 11:17:46 PASSED
MOT TEST: 28 January 2013 11:17:46 PASSED

This test (226378523071) was completed on the 28 January 2013 11:17:46 and PASSED the requirements for a valid MOT with 0 comments.

This test (226378523071) was completed on the 28 January 2013 11:17:46 and PASSED the requirements for a valid MOT with 0 comments.

Recorded mileage: 21,787

Recorded mileage: 21,787


MOT TEST: 17 January 2012 16:19:06 PASSED
MOT TEST: 17 January 2012 16:19:06 PASSED

This test (139067812085) was completed on the 17 January 2012 16:19:06 and PASSED the requirements for a valid MOT with 0 comments.

This test (139067812085) was completed on the 17 January 2012 16:19:06 and PASSED the requirements for a valid MOT with 0 comments.

Recorded mileage: 18,451

Recorded mileage: 18,451


MOT TEST: 28 January 2011 16:22:35 PASSED
MOT TEST: 28 January 2011 16:22:35 PASSED

This test (549208821085) was completed on the 28 January 2011 16:22:35 and PASSED the requirements for a valid MOT with 0 comments.

This test (549208821085) was completed on the 28 January 2011 16:22:35 and PASSED the requirements for a valid MOT with 0 comments.

Recorded mileage: 15,264

Recorded mileage: 15,264


MOT TEST: 03 February 2010 10:58:42 PASSED
MOT TEST: 03 February 2010 10:58:42 PASSED

This test (140444930076) was completed on the 03 February 2010 10:58:42 and PASSED the requirements for a valid MOT with 0 comments.

This test (140444930076) was completed on the 03 February 2010 10:58:42 and PASSED the requirements for a valid MOT with 0 comments.

Recorded mileage: 11,583

Recorded mileage: 11,583


MOT TEST: 05 December 2008 11:18:54 PASSED
MOT TEST: 05 December 2008 11:18:54 PASSED

This test (871740548376) was completed on the 05 December 2008 11:18:54 and PASSED the requirements for a valid MOT with 0 comments.

This test (871740548376) was completed on the 05 December 2008 11:18:54 and PASSED the requirements for a valid MOT with 0 comments.

Recorded mileage: 11,297

Recorded mileage: 11,297


MOT TEST: 06 December 2007 11:33:20 PASSED
MOT TEST: 06 December 2007 11:33:20 PASSED

This test (410280647385) was completed on the 06 December 2007 11:33:20 and PASSED the requirements for a valid MOT with 0 comments.

This test (410280647385) was completed on the 06 December 2007 11:33:20 and PASSED the requirements for a valid MOT with 0 comments.

Recorded mileage: 8,951

Recorded mileage: 8,951


MOT TEST: 08 December 2006 11:38:03 PASSED
MOT TEST: 08 December 2006 11:38:03 PASSED

This test (501832246319) was completed on the 08 December 2006 11:38:03 and PASSED the requirements for a valid MOT with 0 comments.

This test (501832246319) was completed on the 08 December 2006 11:38:03 and PASSED the requirements for a valid MOT with 0 comments.

Recorded mileage: 8,318

Recorded mileage: 8,318