263 SPH


263SPH is registered to a White 1961, Morris Minor with a Petrol engine. It Passed its most recent MOT Test on the 23 November 2018

6 unique faults (8 Total) reported in its MOT History (9 Tests).

2 common/recurring faults, the most frequent (2 times) is: Nearside Front Shock absorber has a slightly reduced damping effect (2.7.5).

78% (7) MOT Pass Rate and a 22% (2) MOT Failure Rate.

30,893 recorded miles.

263 SPH


263SPH is registered to a White 1961, Morris Minor with a Petrol engine. It Passed its most recent MOT Test on the 23 November 2018

6 unique faults (8 Total) reported in its MOT History (9 Tests).

2 common/recurring faults, the most frequent (2 times) is: Nearside Front Shock absorber has a slightly reduced damping effect (2.7.5).

78% (7) MOT Pass Rate and a 22% (2) MOT Failure Rate.

30,893 recorded miles.

MOT PASS/Failure rate for 263 SPH

all MOT test results for 263 SPH represented as a percentage
MOT PASS/Failure rate for 263 SPH
all MOT test results for 263 SPH represented as a percentage

PERCENTAGE OF VEHICLE FAULTS WITH 263 SPH

ALL REPORTED FAULTS, DISPLAYED BY PERCENTAGE OF OCCURRENCE DURING ALL MOT TESTS
PERCENTAGE OF VEHICLE FAULTS WITH 263 SPH
ALL REPORTED FAULTS, DISPLAYED BY PERCENTAGE OF OCCURRENCE DURING ALL MOT TESTS
ADVISORY

FAIL

USER ENTERED

PASS WITH RECTIFICATION

263 SPH annual Faults by type

ALL REPORTED FAULTS, DISPLAYED over time and categorised by type
263 SPH annual Faults by type
ALL REPORTED FAULTS, DISPLAYED over time and categorised by type

RECURRING FAULTS WITH 263 SPH

FAULTS THAT HAVE OCCURED MORE THAN ONCE DURING 263 SPH's MOT HISTORY
RECURRING FAULTS WITH 263 SPH
FAULTS THAT HAVE OCCURED MORE THAN ONCE DURING 263 SPH's MOT HISTORY
Fault Fault Test Date Test Date/Time Reference MOT Test Reference
2 Nearside front shock absorber has a slightly reduced damping effect (2.7.5) Nearside front shock absorber has a slightly reduced damping effect (2.7.5) 29 June 2006 [15:26] 29/06/2006 24 June 2006 [11:48] 24/06/2006 581070386112 581070386112 851245976100 851245976100
2 Oil leak Oil leak 29 June 2006 [15:26] 29/06/2006 24 June 2006 [11:48] 24/06/2006 581070386112 581070386112 851245976100 851245976100

ALL 263 SPH ADVISORIES [2]

ALL ADVISORIES, ORDERED by OCCURRENCE DURING 263 SPH's MOT HISTORY
ALL 263 SPH ADVISORIES [2]
ALL ADVISORIES, ORDERED by OCCURRENCE DURING 263 SPH's MOT HISTORY
Advisory Faults | source www.vehiclestats.co.uk
Fault Fault Test Date Test Date/Time Reference MOT Test Reference
2 Nearside front shock absorber has a slightly reduced damping effect (2.7.5) Nearside front shock absorber has a slightly reduced damping effect (2.7.5) 29 June 2006 [15:26] 29/06/2006 24 June 2006 [11:48] 24/06/2006 581070386112 581070386112 851245976100 851245976100

ALL 263 SPH Failure Faults [3]

ALL Failure faults, ORDERED by OCCURRENCE DURING 263 SPH's MOT HISTORY
ALL 263 SPH Failure Faults [3]
ALL Failure faults, ORDERED by OCCURRENCE DURING 263 SPH's MOT HISTORY
Fail Faults | source www.vehiclestats.co.uk
Fault Fault Test Date Test Date/Time Reference MOT Test Reference
1 Nearside rear service brake excessively binding (1.2.1 (f)) Nearside rear service brake excessively binding (1.2.1 (f)) 02 November 2018 [14:58] 02/11/2018 143429817157 143429817157
1 Nearside front service brake lagging in operation (1.2.1 (d)) Nearside front service brake lagging in operation (1.2.1 (d)) 02 November 2018 [14:58] 02/11/2018 143429817157 143429817157
1 Brakes imbalanced across an axle (3.7.b.5b) Brakes imbalanced across an axle (3.7.b.5b) 24 June 2006 [11:48] 24/06/2006 851245976100 851245976100

ALL 263 SPH User Entered Faults [2]

ALL User Entered faults, ORDERED by OCCURRENCE DURING 263 SPH's MOT HISTORY
ALL 263 SPH User Entered Faults [2]
ALL User Entered faults, ORDERED by OCCURRENCE DURING 263 SPH's MOT HISTORY
Advisory Faults | source www.vehiclestats.co.uk
Fault Fault Test Date Test Date/Time Reference MOT Test Reference
2 Oil leak Oil leak 29 June 2006 [15:26] 29/06/2006 24 June 2006 [11:48] 24/06/2006 581070386112 581070386112 851245976100 851245976100

ALL 263 SPH Pass With Rectification Faults [1]

ALL Pass With Rectification faults, ORDERED by OCCURRENCE DURING 263 SPH's MOT HISTORY
ALL 263 SPH Pass With Rectification Faults [1]
ALL Pass With Rectification faults, ORDERED by OCCURRENCE DURING 263 SPH's MOT HISTORY
Pass With Rectification Faults | source www.vehiclestats.co.uk
Fault Fault Test Date Test Date/Time Reference MOT Test Reference
1 Offside rear position lamp(s) excessively deteriorated so that it is not visible from a reasonable distance (1.1.a.3d) Offside rear position lamp(s) excessively deteriorated so that it is not visible from a reasonable distance (1.1.a.3d) 24 June 2006 [11:48] 24/06/2006 851245976100 851245976100

MOT TEST: 23 November 2018 11:00:12 PASSED
MOT TEST: 23 November 2018 11:00:12 PASSED

This test (732741953379) was completed on the 23 November 2018 11:00:12 and PASSED the requirements for a valid MOT with 0 comments.

This test (732741953379) was completed on the 23 November 2018 11:00:12 and PASSED the requirements for a valid MOT with 0 comments.

Recorded mileage: 30,893

Recorded mileage: 30,893


MOT TEST: 02 November 2018 14:58:41 FAILED
MOT TEST: 02 November 2018 14:58:41 FAILED

This test (143429817157) was completed on the 02 November 2018 14:58:41 and FAILED the requirements for a valid MOT with 2 comments.

This test (143429817157) was completed on the 02 November 2018 14:58:41 and FAILED the requirements for a valid MOT with 2 comments.

Recorded mileage: 30,885

Recorded mileage: 30,885


FAIL


MOT TEST: 16 October 2017 10:20:46 PASSED
MOT TEST: 16 October 2017 10:20:46 PASSED

This test (735338075991) was completed on the 16 October 2017 10:20:46 and PASSED the requirements for a valid MOT with 0 comments.

This test (735338075991) was completed on the 16 October 2017 10:20:46 and PASSED the requirements for a valid MOT with 0 comments.

Recorded mileage: 30,823

Recorded mileage: 30,823


MOT TEST: 03 July 2014 13:29:08 PASSED
MOT TEST: 03 July 2014 13:29:08 PASSED

This test (946684084151) was completed on the 03 July 2014 13:29:08 and PASSED the requirements for a valid MOT with 0 comments.

This test (946684084151) was completed on the 03 July 2014 13:29:08 and PASSED the requirements for a valid MOT with 0 comments.

Recorded mileage: 27,971

Recorded mileage: 27,971


MOT TEST: 15 June 2012 13:47:27 PASSED
MOT TEST: 15 June 2012 13:47:27 PASSED

This test (325447662153) was completed on the 15 June 2012 13:47:27 and PASSED the requirements for a valid MOT with 0 comments.

This test (325447662153) was completed on the 15 June 2012 13:47:27 and PASSED the requirements for a valid MOT with 0 comments.

Recorded mileage: 30,777

Recorded mileage: 30,777


MOT TEST: 01 July 2010 10:42:11 PASSED
MOT TEST: 01 July 2010 10:42:11 PASSED

This test (903222080196) was completed on the 01 July 2010 10:42:11 and PASSED the requirements for a valid MOT with 0 comments.

This test (903222080196) was completed on the 01 July 2010 10:42:11 and PASSED the requirements for a valid MOT with 0 comments.

Recorded mileage: 30,769

Recorded mileage: 30,769


MOT TEST: 19 May 2008 16:16:44 PASSED
MOT TEST: 19 May 2008 16:16:44 PASSED

This test (273630048193) was completed on the 19 May 2008 16:16:44 and PASSED the requirements for a valid MOT with 0 comments.

This test (273630048193) was completed on the 19 May 2008 16:16:44 and PASSED the requirements for a valid MOT with 0 comments.

Recorded mileage: 3,740

Recorded mileage: 3,740


MOT TEST: 29 June 2006 15:26:25 PASSED
MOT TEST: 29 June 2006 15:26:25 PASSED

This test (581070386112) was completed on the 29 June 2006 15:26:25 and PASSED the requirements for a valid MOT with 2 comments.

This test (581070386112) was completed on the 29 June 2006 15:26:25 and PASSED the requirements for a valid MOT with 2 comments.

Recorded mileage: 30,601

Recorded mileage: 30,601


ADVISORY

USER ENTERED


MOT TEST: 24 June 2006 11:48:48 FAILED
MOT TEST: 24 June 2006 11:48:48 FAILED

This test (851245976100) was completed on the 24 June 2006 11:48:48 and FAILED the requirements for a valid MOT with 4 comments.

This test (851245976100) was completed on the 24 June 2006 11:48:48 and FAILED the requirements for a valid MOT with 4 comments.

Recorded mileage: 30,594

Recorded mileage: 30,594


ADVISORY

FAIL

USER ENTERED

PASS WITH RECTIFICATION