264 9NK


2649NK is registered to a White 1960, Morris Mini with a Petrol engine. It Failed its most recent MOT Test on the 25 May 2018

23 unique faults (26 Total) reported in its MOT History (17 Tests).

3 common/recurring faults, the most frequent (2 times) is: Nearside Front Front suspension has slight play in a upper suspension ball joint (2.5.B.1a).

71% (12) MOT Pass Rate and a 29% (5) MOT Failure Rate.

32,203 recorded miles.

264 9NK


2649NK is registered to a White 1960, Morris Mini with a Petrol engine. It Failed its most recent MOT Test on the 25 May 2018

23 unique faults (26 Total) reported in its MOT History (17 Tests).

3 common/recurring faults, the most frequent (2 times) is: Nearside Front Front suspension has slight play in a upper suspension ball joint (2.5.B.1a).

71% (12) MOT Pass Rate and a 29% (5) MOT Failure Rate.

32,203 recorded miles.

MOT PASS/Failure rate for 264 9NK

all MOT test results for 264 9NK represented as a percentage
MOT PASS/Failure rate for 264 9NK
all MOT test results for 264 9NK represented as a percentage

PERCENTAGE OF VEHICLE FAULTS WITH 264 9NK

ALL REPORTED FAULTS, DISPLAYED BY PERCENTAGE OF OCCURRENCE DURING ALL MOT TESTS
PERCENTAGE OF VEHICLE FAULTS WITH 264 9NK
ALL REPORTED FAULTS, DISPLAYED BY PERCENTAGE OF OCCURRENCE DURING ALL MOT TESTS
ADVISORY

FAIL

USER ENTERED

PASS WITH RECTIFICATION

264 9NK annual Faults by type

ALL REPORTED FAULTS, DISPLAYED over time and categorised by type
264 9NK annual Faults by type
ALL REPORTED FAULTS, DISPLAYED over time and categorised by type

RECURRING FAULTS WITH 264 9NK

FAULTS THAT HAVE OCCURED MORE THAN ONCE DURING 264 9NK's MOT HISTORY
RECURRING FAULTS WITH 264 9NK
FAULTS THAT HAVE OCCURED MORE THAN ONCE DURING 264 9NK's MOT HISTORY
Fault Fault Test Date Test Date/Time Reference MOT Test Reference
2 Nearside front front suspension has slight play in a upper suspension ball joint (2.5.b.1a) Nearside front front suspension has slight play in a upper suspension ball joint (2.5.b.1a) 25 May 2018 [15:12] 25/05/2018 16 May 2018 [14:13] 16/05/2018 685633940606 685633940606 437640206167 437640206167
2 Offside windscreen has slight scratching. Offside windscreen has slight scratching. 27 May 2014 [17:07] 27/05/2014 23 May 2014 [17:22] 23/05/2014 355787844126 355787844126 766893844182 766893844182
2 Rear exhaust has a minor leak of exhaust gases (7.1.2) Rear exhaust has a minor leak of exhaust gases (7.1.2) 22 March 2012 [17:04] 22/03/2012 22 March 2012 [17:04] 22/03/2012 349752182043 349752182043 885952282021 885952282021

ALL 264 9NK ADVISORIES [12]

ALL ADVISORIES, ORDERED by OCCURRENCE DURING 264 9NK's MOT HISTORY
ALL 264 9NK ADVISORIES [12]
ALL ADVISORIES, ORDERED by OCCURRENCE DURING 264 9NK's MOT HISTORY
Advisory Faults | source www.vehiclestats.co.uk
Fault Fault Test Date Test Date/Time Reference MOT Test Reference
2 Nearside front front suspension has slight play in a upper suspension ball joint (2.5.b.1a) Nearside front front suspension has slight play in a upper suspension ball joint (2.5.b.1a) 25 May 2018 [15:12] 25/05/2018 16 May 2018 [14:13] 16/05/2018 685633940606 685633940606 437640206167 437640206167
2 Rear exhaust has a minor leak of exhaust gases (7.1.2) Rear exhaust has a minor leak of exhaust gases (7.1.2) 22 March 2012 [17:04] 22/03/2012 22 March 2012 [17:04] 22/03/2012 349752182043 349752182043 885952282021 885952282021
1 Offside rear tyre perished in tread Offside rear tyre perished in tread 16 May 2018 [14:13] 16/05/2018 437640206167 437640206167
1 Nearside rear tyre showing signs of perishing in tread Nearside rear tyre showing signs of perishing in tread 16 May 2018 [14:13] 16/05/2018 437640206167 437640206167
1 Front exhaust has a minor leak of exhaust gases (7.1.2) Front exhaust has a minor leak of exhaust gases (7.1.2) 27 May 2016 [14:41] 27/05/2016 450264431373 450264431373
1 Offside windscreen has slight scratching Offside windscreen has slight scratching 27 May 2016 [14:41] 27/05/2016 450264431373 450264431373
1 Offside front subframe mounting prescribed area is corroded but not considered excessive (2.4.a.3) Offside front subframe mounting prescribed area is corroded but not considered excessive (2.4.a.3) 12 December 2008 [16:36] 12/12/2008 132197248362 132197248362
1 Steering column top bearing slightly worn (2.1.2c) Steering column top bearing slightly worn (2.1.2c) 11 December 2006 [17:34] 11/12/2006 950025746352 950025746352
1 Nearside front upper axle swivel joint has slight play (2.5.a.3b) Nearside front upper axle swivel joint has slight play (2.5.a.3b) 11 December 2006 [17:34] 11/12/2006 950025746352 950025746352
1 Offside steering pivot point has slight play (2.2.b.1g) Offside steering pivot point has slight play (2.2.b.1g) 12 December 2005 [17:27] 12/12/2005 741706645336 741706645336

ALL 264 9NK Failure Faults [7]

ALL Failure faults, ORDERED by OCCURRENCE DURING 264 9NK's MOT HISTORY
ALL 264 9NK Failure Faults [7]
ALL Failure faults, ORDERED by OCCURRENCE DURING 264 9NK's MOT HISTORY
Fail Faults | source www.vehiclestats.co.uk
Fault Fault Test Date Test Date/Time Reference MOT Test Reference
1 Offside front headlamp not working on dipped beam (1.7.5a) Offside front headlamp not working on dipped beam (1.7.5a) 16 May 2018 [14:13] 16/05/2018 437640206167 437640206167
1 Rear registration plate lamp not working (1.1.c.1d) Rear registration plate lamp not working (1.1.c.1d) 16 May 2018 [14:13] 16/05/2018 437640206167 437640206167
1 Offside front tyre tread depth below requirements of 1.6mm (4.1.e.1) Offside front tyre tread depth below requirements of 1.6mm (4.1.e.1) 16 May 2018 [14:13] 16/05/2018 437640206167 437640206167
1 Nearside rear brake recording little or no effort (3.7.b.5a) Nearside rear brake recording little or no effort (3.7.b.5a) 23 May 2014 [17:22] 23/05/2014 766893844182 766893844182
1 Brakes imbalanced across an axle (3.7.b.5b) Brakes imbalanced across an axle (3.7.b.5b) 23 May 2014 [17:22] 23/05/2014 766893844182 766893844182
1 Nearside front lower front suspension ball joint dust cover missing (2.4.g.2) Nearside front lower front suspension ball joint dust cover missing (2.4.g.2) 24 May 2013 [16:21] 24/05/2013 308444743146 308444743146
1 Rear exhaust has a major leak of exhaust gases (7.1.2) Rear exhaust has a major leak of exhaust gases (7.1.2) 24 May 2013 [16:21] 24/05/2013 308444743146 308444743146

ALL 264 9NK User Entered Faults [4]

ALL User Entered faults, ORDERED by OCCURRENCE DURING 264 9NK's MOT HISTORY
ALL 264 9NK User Entered Faults [4]
ALL User Entered faults, ORDERED by OCCURRENCE DURING 264 9NK's MOT HISTORY
User Entered Faults | source www.vehiclestats.co.uk
Fault Fault Test Date Test Date/Time Reference MOT Test Reference
2 Offside windscreen has slight scratching. Offside windscreen has slight scratching. 27 May 2014 [17:07] 27/05/2014 23 May 2014 [17:22] 23/05/2014 355787844126 355787844126 766893844182 766893844182
1 Front brakes are imbalanced but not in excess of 25%. Front brakes are imbalanced but not in excess of 25%. 12 December 2008 [16:36] 12/12/2008 132197248362 132197248362
1 Nearside front lower swivel joint rubber dust cover is damaged. Nearside front lower swivel joint rubber dust cover is damaged. 11 December 2006 [17:34] 11/12/2006 950025746352 950025746352

ALL 264 9NK Pass With Rectification Faults [3]

ALL Pass With Rectification faults, ORDERED by OCCURRENCE DURING 264 9NK's MOT HISTORY
ALL 264 9NK Pass With Rectification Faults [3]
ALL Pass With Rectification faults, ORDERED by OCCURRENCE DURING 264 9NK's MOT HISTORY
Pass With Rectification Faults | source www.vehiclestats.co.uk
Fault Fault Test Date Test Date/Time Reference MOT Test Reference
1 Registration plate lamp not working (1.1.c.1d) Registration plate lamp not working (1.1.c.1d) 22 March 2012 [17:04] 22/03/2012 885952282021 885952282021
1 Nearside windscreen wiper does not clear the windscreen effectively (8.2.2) Nearside windscreen wiper does not clear the windscreen effectively (8.2.2) 25 March 2011 [17:17] 25/03/2011 586644381012 586644381012
1 Offside windscreen wiper does not clear the windscreen effectively (8.2.2) Offside windscreen wiper does not clear the windscreen effectively (8.2.2) 25 March 2011 [17:17] 25/03/2011 586644381012 586644381012

MOT TEST: 25 May 2018 15:12:31 PASSED
MOT TEST: 25 May 2018 15:12:31 PASSED

This test (685633940606) was completed on the 25 May 2018 15:12:31 and PASSED the requirements for a valid MOT with 1 comments.

This test (685633940606) was completed on the 25 May 2018 15:12:31 and PASSED the requirements for a valid MOT with 1 comments.

Recorded mileage: 32,203

Recorded mileage: 32,203


ADVISORY


MOT TEST: 16 May 2018 14:13:23 FAILED
MOT TEST: 16 May 2018 14:13:23 FAILED

This test (437640206167) was completed on the 16 May 2018 14:13:23 and FAILED the requirements for a valid MOT with 6 comments.

This test (437640206167) was completed on the 16 May 2018 14:13:23 and FAILED the requirements for a valid MOT with 6 comments.

Recorded mileage: 32,203

Recorded mileage: 32,203


ADVISORY

FAIL


MOT TEST: 27 May 2016 14:41:47 PASSED
MOT TEST: 27 May 2016 14:41:47 PASSED

This test (450264431373) was completed on the 27 May 2016 14:41:47 and PASSED the requirements for a valid MOT with 2 comments.

This test (450264431373) was completed on the 27 May 2016 14:41:47 and PASSED the requirements for a valid MOT with 2 comments.

Recorded mileage: 31,691

Recorded mileage: 31,691


ADVISORY


MOT TEST: 13 May 2015 17:10:24 PASSED
MOT TEST: 13 May 2015 17:10:24 PASSED

This test (909373435151) was completed on the 13 May 2015 17:10:24 and PASSED the requirements for a valid MOT with 0 comments.

This test (909373435151) was completed on the 13 May 2015 17:10:24 and PASSED the requirements for a valid MOT with 0 comments.

Recorded mileage: 31,230

Recorded mileage: 31,230


MOT TEST: 27 May 2014 17:07:45 PASSED
MOT TEST: 27 May 2014 17:07:45 PASSED

This test (355787844126) was completed on the 27 May 2014 17:07:45 and PASSED the requirements for a valid MOT with 1 comments.

This test (355787844126) was completed on the 27 May 2014 17:07:45 and PASSED the requirements for a valid MOT with 1 comments.

Recorded mileage: 31,000

Recorded mileage: 31,000


USER ENTERED


MOT TEST: 23 May 2014 17:22:30 FAILED
MOT TEST: 23 May 2014 17:22:30 FAILED

This test (766893844182) was completed on the 23 May 2014 17:22:30 and FAILED the requirements for a valid MOT with 3 comments.

This test (766893844182) was completed on the 23 May 2014 17:22:30 and FAILED the requirements for a valid MOT with 3 comments.

Recorded mileage: 30,996

Recorded mileage: 30,996


FAIL

USER ENTERED


MOT TEST: 24 May 2013 18:15:10 PASSED
MOT TEST: 24 May 2013 18:15:10 PASSED

This test (565594343165) was completed on the 24 May 2013 18:15:10 and PASSED the requirements for a valid MOT with 0 comments.

This test (565594343165) was completed on the 24 May 2013 18:15:10 and PASSED the requirements for a valid MOT with 0 comments.

Recorded mileage: 30,650

Recorded mileage: 30,650


MOT TEST: 24 May 2013 16:21:45 FAILED
MOT TEST: 24 May 2013 16:21:45 FAILED

This test (308444743146) was completed on the 24 May 2013 16:21:45 and FAILED the requirements for a valid MOT with 2 comments.

This test (308444743146) was completed on the 24 May 2013 16:21:45 and FAILED the requirements for a valid MOT with 2 comments.

Recorded mileage: 30,650

Recorded mileage: 30,650


FAIL


MOT TEST: 22 March 2012 17:04:51 PASSED
MOT TEST: 22 March 2012 17:04:51 PASSED

This test (349752182043) was completed on the 22 March 2012 17:04:51 and PASSED the requirements for a valid MOT with 1 comments.

This test (349752182043) was completed on the 22 March 2012 17:04:51 and PASSED the requirements for a valid MOT with 1 comments.

Recorded mileage: 30,259

Recorded mileage: 30,259


ADVISORY


MOT TEST: 22 March 2012 17:04:51 FAILED
MOT TEST: 22 March 2012 17:04:51 FAILED

This test (885952282021) was completed on the 22 March 2012 17:04:51 and FAILED the requirements for a valid MOT with 2 comments.

This test (885952282021) was completed on the 22 March 2012 17:04:51 and FAILED the requirements for a valid MOT with 2 comments.

Recorded mileage: 30,259

Recorded mileage: 30,259


ADVISORY

PASS WITH RECTIFICATION


MOT TEST: 25 March 2011 17:17:03 PASSED
MOT TEST: 25 March 2011 17:17:03 PASSED

This test (126304481434) was completed on the 25 March 2011 17:17:03 and PASSED the requirements for a valid MOT with 0 comments.

This test (126304481434) was completed on the 25 March 2011 17:17:03 and PASSED the requirements for a valid MOT with 0 comments.

Recorded mileage: 29,878

Recorded mileage: 29,878


MOT TEST: 25 March 2011 17:17:03 FAILED
MOT TEST: 25 March 2011 17:17:03 FAILED

This test (586644381012) was completed on the 25 March 2011 17:17:03 and FAILED the requirements for a valid MOT with 2 comments.

This test (586644381012) was completed on the 25 March 2011 17:17:03 and FAILED the requirements for a valid MOT with 2 comments.

Recorded mileage: 29,878

Recorded mileage: 29,878


PASS WITH RECTIFICATION


MOT TEST: 19 March 2010 15:51:04 PASSED
MOT TEST: 19 March 2010 15:51:04 PASSED

This test (411968270019) was completed on the 19 March 2010 15:51:04 and PASSED the requirements for a valid MOT with 0 comments.

This test (411968270019) was completed on the 19 March 2010 15:51:04 and PASSED the requirements for a valid MOT with 0 comments.

Recorded mileage: 29,449

Recorded mileage: 29,449


MOT TEST: 12 December 2008 16:36:52 PASSED
MOT TEST: 12 December 2008 16:36:52 PASSED

This test (132197248362) was completed on the 12 December 2008 16:36:52 and PASSED the requirements for a valid MOT with 2 comments.

This test (132197248362) was completed on the 12 December 2008 16:36:52 and PASSED the requirements for a valid MOT with 2 comments.

Recorded mileage: 29,009

Recorded mileage: 29,009


ADVISORY

USER ENTERED


MOT TEST: 28 December 2007 15:16:35 PASSED
MOT TEST: 28 December 2007 15:16:35 PASSED

This test (452142167464) was completed on the 28 December 2007 15:16:35 and PASSED the requirements for a valid MOT with 0 comments.

This test (452142167464) was completed on the 28 December 2007 15:16:35 and PASSED the requirements for a valid MOT with 0 comments.

Recorded mileage: 28,858

Recorded mileage: 28,858


MOT TEST: 11 December 2006 17:34:26 PASSED
MOT TEST: 11 December 2006 17:34:26 PASSED

This test (950025746352) was completed on the 11 December 2006 17:34:26 and PASSED the requirements for a valid MOT with 3 comments.

This test (950025746352) was completed on the 11 December 2006 17:34:26 and PASSED the requirements for a valid MOT with 3 comments.

Recorded mileage: 28,369

Recorded mileage: 28,369


ADVISORY

USER ENTERED


MOT TEST: 12 December 2005 17:27:22 PASSED
MOT TEST: 12 December 2005 17:27:22 PASSED

This test (741706645336) was completed on the 12 December 2005 17:27:22 and PASSED the requirements for a valid MOT with 1 comments.

This test (741706645336) was completed on the 12 December 2005 17:27:22 and PASSED the requirements for a valid MOT with 1 comments.

Recorded mileage: 27,546

Recorded mileage: 27,546


ADVISORY