264 UXB


264UXB is registered to a Grey 1971, Morris Minor 1000 with a Petrol engine. It Passed its most recent MOT Test on the 19 February 2019

9 unique faults (10 Total) reported in its MOT History (7 Tests).

1 common/recurring faults.

71% (5) MOT Pass Rate and a 29% (2) MOT Failure Rate.

76,343 recorded miles.

264 UXB


264UXB is registered to a Grey 1971, Morris Minor 1000 with a Petrol engine. It Passed its most recent MOT Test on the 19 February 2019

9 unique faults (10 Total) reported in its MOT History (7 Tests).

1 common/recurring faults.

71% (5) MOT Pass Rate and a 29% (2) MOT Failure Rate.

76,343 recorded miles.

MOT PASS/Failure rate for 264 UXB

all MOT test results for 264 UXB represented as a percentage
MOT PASS/Failure rate for 264 UXB
all MOT test results for 264 UXB represented as a percentage

PERCENTAGE OF VEHICLE FAULTS WITH 264 UXB

ALL REPORTED FAULTS, DISPLAYED BY PERCENTAGE OF OCCURRENCE DURING ALL MOT TESTS
PERCENTAGE OF VEHICLE FAULTS WITH 264 UXB
ALL REPORTED FAULTS, DISPLAYED BY PERCENTAGE OF OCCURRENCE DURING ALL MOT TESTS
FAIL

USER ENTERED

PASS WITH RECTIFICATION

264 UXB annual Faults by type

ALL REPORTED FAULTS, DISPLAYED over time and categorised by type
264 UXB annual Faults by type
ALL REPORTED FAULTS, DISPLAYED over time and categorised by type

ALL 264 UXB Failure Faults [6]

ALL Failure faults, ORDERED by OCCURRENCE DURING 264 UXB's MOT HISTORY
ALL 264 UXB Failure Faults [6]
ALL Failure faults, ORDERED by OCCURRENCE DURING 264 UXB's MOT HISTORY
Pass With Rectification Faults | source www.vehiclestats.co.uk
Fault Fault Test Date Test Date/Time Reference MOT Test Reference
1 Nearside front brake hose excessively deteriorated (3.6.b.4d) Nearside front brake hose excessively deteriorated (3.6.b.4d) 28 November 2012 [13:21] 28/11/2012 526433932357 526433932357
1 Headlamp aim too high (hotspot centre above the horizontal 0% line) (1.6.c1) Headlamp aim too high (hotspot centre above the horizontal 0% line) (1.6.c1) 22 December 2005 [10:52] 22/12/2005 892756755321 892756755321
1 Nearside front torsion bar excessive play at an end fixing (2.4.e.2) Nearside front torsion bar excessive play at an end fixing (2.4.e.2) 22 December 2005 [10:52] 22/12/2005 892756755321 892756755321
1 Nearside front upper front suspension has excessive play in a upper suspension ball joint (2.5.b.1a) Nearside front upper front suspension has excessive play in a upper suspension ball joint (2.5.b.1a) 22 December 2005 [10:52] 22/12/2005 892756755321 892756755321
1 Nearside rear brake cable locking device insecure (3.5.1l) Nearside rear brake cable locking device insecure (3.5.1l) 22 December 2005 [10:52] 22/12/2005 892756755321 892756755321
1 Parking brake: efficiency below requirements (3.7.b.7) Parking brake: efficiency below requirements (3.7.b.7) 22 December 2005 [10:52] 22/12/2005 892756755321 892756755321

ALL 264 UXB User Entered Faults [2]

ALL User Entered faults, ORDERED by OCCURRENCE DURING 264 UXB's MOT HISTORY
ALL 264 UXB User Entered Faults [2]
ALL User Entered faults, ORDERED by OCCURRENCE DURING 264 UXB's MOT HISTORY
User Entered Faults | source www.vehiclestats.co.uk
Fault Fault Test Date Test Date/Time Reference MOT Test Reference
2 Only interior mirror fitted to vehicle. Only interior mirror fitted to vehicle. 28 November 2012 [15:21] 28/11/2012 28 November 2012 [13:21] 28/11/2012 559603832357 559603832357 526433932357 526433932357

ALL 264 UXB Pass With Rectification Faults [2]

ALL Pass With Rectification faults, ORDERED by OCCURRENCE DURING 264 UXB's MOT HISTORY
ALL 264 UXB Pass With Rectification Faults [2]
ALL Pass With Rectification faults, ORDERED by OCCURRENCE DURING 264 UXB's MOT HISTORY
Pass With Rectification Faults | source www.vehiclestats.co.uk
Fault Fault Test Date Test Date/Time Reference MOT Test Reference
1 Nearside front position lamp(s) not working (1.1.a.3b) Nearside front position lamp(s) not working (1.1.a.3b) 28 November 2012 [13:21] 28/11/2012 526433932357 526433932357
1 Offside front position lamp(s) not working (1.1.a.3b) Offside front position lamp(s) not working (1.1.a.3b) 28 November 2012 [13:21] 28/11/2012 526433932357 526433932357

MOT TEST: 19 February 2019 16:58:13 PASSED
MOT TEST: 19 February 2019 16:58:13 PASSED

This test (249551994347) was completed on the 19 February 2019 16:58:13 and PASSED the requirements for a valid MOT with 0 comments.

This test (249551994347) was completed on the 19 February 2019 16:58:13 and PASSED the requirements for a valid MOT with 0 comments.

Recorded mileage: 76,343

Recorded mileage: 76,343


MOT TEST: 19 April 2018 16:28:33 PASSED
MOT TEST: 19 April 2018 16:28:33 PASSED

This test (487135115737) was completed on the 19 April 2018 16:28:33 and PASSED the requirements for a valid MOT with 0 comments.

This test (487135115737) was completed on the 19 April 2018 16:28:33 and PASSED the requirements for a valid MOT with 0 comments.

Recorded mileage: 75,623

Recorded mileage: 75,623


MOT TEST: 18 April 2017 09:38:58 PASSED
MOT TEST: 18 April 2017 09:38:58 PASSED

This test (233372487252) was completed on the 18 April 2017 09:38:58 and PASSED the requirements for a valid MOT with 0 comments.

This test (233372487252) was completed on the 18 April 2017 09:38:58 and PASSED the requirements for a valid MOT with 0 comments.

Recorded mileage: 74,251

Recorded mileage: 74,251


MOT TEST: 28 November 2012 15:21:59 PASSED
MOT TEST: 28 November 2012 15:21:59 PASSED

This test (559603832357) was completed on the 28 November 2012 15:21:59 and PASSED the requirements for a valid MOT with 1 comments.

This test (559603832357) was completed on the 28 November 2012 15:21:59 and PASSED the requirements for a valid MOT with 1 comments.

Recorded mileage: 74,235

Recorded mileage: 74,235


USER ENTERED


MOT TEST: 28 November 2012 13:21:53 FAILED
MOT TEST: 28 November 2012 13:21:53 FAILED

This test (526433932357) was completed on the 28 November 2012 13:21:53 and FAILED the requirements for a valid MOT with 4 comments.

This test (526433932357) was completed on the 28 November 2012 13:21:53 and FAILED the requirements for a valid MOT with 4 comments.

Recorded mileage: 74,235

Recorded mileage: 74,235


FAIL

USER ENTERED

PASS WITH RECTIFICATION


MOT TEST: 06 February 2006 12:12:17 PASSED
MOT TEST: 06 February 2006 12:12:17 PASSED

This test (732457136060) was completed on the 06 February 2006 12:12:17 and PASSED the requirements for a valid MOT with 0 comments.

This test (732457136060) was completed on the 06 February 2006 12:12:17 and PASSED the requirements for a valid MOT with 0 comments.

Recorded mileage: 74,187

Recorded mileage: 74,187


MOT TEST: 22 December 2005 10:52:23 FAILED
MOT TEST: 22 December 2005 10:52:23 FAILED

This test (892756755321) was completed on the 22 December 2005 10:52:23 and FAILED the requirements for a valid MOT with 5 comments.

This test (892756755321) was completed on the 22 December 2005 10:52:23 and FAILED the requirements for a valid MOT with 5 comments.

Recorded mileage: 74,179

Recorded mileage: 74,179


FAIL