265 UXS


265UXS is registered to a Blue 1958, Morris with a Petrol engine. It Failed its most recent MOT Test on the 10 May 2012

10 unique faults (10 Total) reported in its MOT History (9 Tests).

0 common/recurring faults.

67% (6) MOT Pass Rate and a 33% (3) MOT Failure Rate.

56,671 recorded miles.

265 UXS


265UXS is registered to a Blue 1958, Morris with a Petrol engine. It Failed its most recent MOT Test on the 10 May 2012

10 unique faults (10 Total) reported in its MOT History (9 Tests).

0 common/recurring faults.

67% (6) MOT Pass Rate and a 33% (3) MOT Failure Rate.

56,671 recorded miles.

MOT PASS/Failure rate for 265 UXS

all MOT test results for 265 UXS represented as a percentage
MOT PASS/Failure rate for 265 UXS
all MOT test results for 265 UXS represented as a percentage

PERCENTAGE OF VEHICLE FAULTS WITH 265 UXS

ALL REPORTED FAULTS, DISPLAYED BY PERCENTAGE OF OCCURRENCE DURING ALL MOT TESTS
PERCENTAGE OF VEHICLE FAULTS WITH 265 UXS
ALL REPORTED FAULTS, DISPLAYED BY PERCENTAGE OF OCCURRENCE DURING ALL MOT TESTS
ADVISORY

FAIL

USER ENTERED

PASS WITH RECTIFICATION

265 UXS annual Faults by type

ALL REPORTED FAULTS, DISPLAYED over time and categorised by type
265 UXS annual Faults by type
ALL REPORTED FAULTS, DISPLAYED over time and categorised by type

ALL 265 UXS ADVISORIES [1]

ALL ADVISORIES, ORDERED by OCCURRENCE DURING 265 UXS's MOT HISTORY
ALL 265 UXS ADVISORIES [1]
ALL ADVISORIES, ORDERED by OCCURRENCE DURING 265 UXS's MOT HISTORY
Fail Faults | source www.vehiclestats.co.uk
Fault Fault Test Date Test Date/Time Reference MOT Test Reference
1 Nearside upper suspension arm has slight play in a pin/bearing (2.4.g.2) Nearside upper suspension arm has slight play in a pin/bearing (2.4.g.2) 07 July 2007 [10:29] 07/07/2007 754688187107 754688187107

ALL 265 UXS Failure Faults [6]

ALL Failure faults, ORDERED by OCCURRENCE DURING 265 UXS's MOT HISTORY
ALL 265 UXS Failure Faults [6]
ALL Failure faults, ORDERED by OCCURRENCE DURING 265 UXS's MOT HISTORY
Fail Faults | source www.vehiclestats.co.uk
Fault Fault Test Date Test Date/Time Reference MOT Test Reference
1 Front tyre has a cut in excess of the requirements deep enough to reach the ply or cords (4.1.d.1a) Front tyre has a cut in excess of the requirements deep enough to reach the ply or cords (4.1.d.1a) 06 May 2009 [17:28] 06/05/2009 291246529114 291246529114
1 Rear tyre has a tear, caused by separation or partial failure of its structure (4.1.d.1b) Rear tyre has a tear, caused by separation or partial failure of its structure (4.1.d.1b) 06 May 2009 [17:28] 06/05/2009 291246529114 291246529114
1 Nearside front front brake binding (3.7.b.1) Nearside front front brake binding (3.7.b.1) 07 July 2007 [10:29] 07/07/2007 754688187107 754688187107
1 Offside front front brake binding (3.7.b.1) Offside front front brake binding (3.7.b.1) 07 July 2007 [10:29] 07/07/2007 754688187107 754688187107
1 Nearside rear front brake binding (3.7.b.1) Nearside rear front brake binding (3.7.b.1) 07 July 2007 [10:29] 07/07/2007 754688187107 754688187107
1 Offside rear front brake binding (3.7.b.1) Offside rear front brake binding (3.7.b.1) 07 July 2007 [10:29] 07/07/2007 754688187107 754688187107

ALL 265 UXS User Entered Faults [1]

ALL User Entered faults, ORDERED by OCCURRENCE DURING 265 UXS's MOT HISTORY
ALL 265 UXS User Entered Faults [1]
ALL User Entered faults, ORDERED by OCCURRENCE DURING 265 UXS's MOT HISTORY
Fail Faults | source www.vehiclestats.co.uk
Fault Fault Test Date Test Date/Time Reference MOT Test Reference
1 Off side rear tyer near side rear tyer wall perished Off side rear tyer near side rear tyer wall perished 07 July 2007 [10:29] 07/07/2007 754688187107 754688187107

ALL 265 UXS Pass With Rectification Faults [2]

ALL Pass With Rectification faults, ORDERED by OCCURRENCE DURING 265 UXS's MOT HISTORY
ALL 265 UXS Pass With Rectification Faults [2]
ALL Pass With Rectification faults, ORDERED by OCCURRENCE DURING 265 UXS's MOT HISTORY
Pass With Rectification Faults | source www.vehiclestats.co.uk
Fault Fault Test Date Test Date/Time Reference MOT Test Reference
1 Offside front headlamp not working on dipped beam (1.7.5a) Offside front headlamp not working on dipped beam (1.7.5a) 26 January 2006 [08:59] 26/01/2006 181466726474 181466726474
1 Offside rear rear brake recording little or no effort (3.7.b.5a) Offside rear rear brake recording little or no effort (3.7.b.5a) 26 January 2006 [08:59] 26/01/2006 181466726474 181466726474

MOT TEST: 10 May 2012 18:40:32 PASSED
MOT TEST: 10 May 2012 18:40:32 PASSED

This test (869711932165) was completed on the 10 May 2012 18:40:32 and PASSED the requirements for a valid MOT with 0 comments.

This test (869711932165) was completed on the 10 May 2012 18:40:32 and PASSED the requirements for a valid MOT with 0 comments.

Recorded mileage: 56,671

Recorded mileage: 56,671


MOT TEST: 12 May 2011 18:47:05 PASSED
MOT TEST: 12 May 2011 18:47:05 PASSED

This test (107132331126) was completed on the 12 May 2011 18:47:05 and PASSED the requirements for a valid MOT with 0 comments.

This test (107132331126) was completed on the 12 May 2011 18:47:05 and PASSED the requirements for a valid MOT with 0 comments.

Recorded mileage: 56,143

Recorded mileage: 56,143


MOT TEST: 07 May 2010 18:14:43 PASSED
MOT TEST: 07 May 2010 18:14:43 PASSED

This test (294677320471) was completed on the 07 May 2010 18:14:43 and PASSED the requirements for a valid MOT with 0 comments.

This test (294677320471) was completed on the 07 May 2010 18:14:43 and PASSED the requirements for a valid MOT with 0 comments.

Recorded mileage: 55,391

Recorded mileage: 55,391


MOT TEST: 07 May 2009 10:44:59 PASSED
MOT TEST: 07 May 2009 10:44:59 PASSED

This test (204067429161) was completed on the 07 May 2009 10:44:59 and PASSED the requirements for a valid MOT with 0 comments.

This test (204067429161) was completed on the 07 May 2009 10:44:59 and PASSED the requirements for a valid MOT with 0 comments.

Recorded mileage: 54,603

Recorded mileage: 54,603


MOT TEST: 06 May 2009 17:28:31 FAILED
MOT TEST: 06 May 2009 17:28:31 FAILED

This test (291246529114) was completed on the 06 May 2009 17:28:31 and FAILED the requirements for a valid MOT with 2 comments.

This test (291246529114) was completed on the 06 May 2009 17:28:31 and FAILED the requirements for a valid MOT with 2 comments.

Recorded mileage: 54,603

Recorded mileage: 54,603


FAIL


MOT TEST: 10 July 2007 10:05:30 PASSED
MOT TEST: 10 July 2007 10:05:30 PASSED

This test (302841697118) was completed on the 10 July 2007 10:05:30 and PASSED the requirements for a valid MOT with 0 comments.

This test (302841697118) was completed on the 10 July 2007 10:05:30 and PASSED the requirements for a valid MOT with 0 comments.

Recorded mileage: 54,528

Recorded mileage: 54,528


MOT TEST: 07 July 2007 10:29:45 FAILED
MOT TEST: 07 July 2007 10:29:45 FAILED

This test (754688187107) was completed on the 07 July 2007 10:29:45 and FAILED the requirements for a valid MOT with 6 comments.

This test (754688187107) was completed on the 07 July 2007 10:29:45 and FAILED the requirements for a valid MOT with 6 comments.

Recorded mileage: 54,527

Recorded mileage: 54,527


ADVISORY

FAIL

USER ENTERED


MOT TEST: 26 January 2006 08:59:11 FAILED
MOT TEST: 26 January 2006 08:59:11 FAILED

This test (181466726474) was completed on the 26 January 2006 08:59:11 and FAILED the requirements for a valid MOT with 2 comments.

This test (181466726474) was completed on the 26 January 2006 08:59:11 and FAILED the requirements for a valid MOT with 2 comments.

Recorded mileage: 54,397

Recorded mileage: 54,397


PASS WITH RECTIFICATION


MOT TEST: 26 January 2006 08:59:11 PASSED
MOT TEST: 26 January 2006 08:59:11 PASSED

This test (833215926076) was completed on the 26 January 2006 08:59:11 and PASSED the requirements for a valid MOT with 0 comments.

This test (833215926076) was completed on the 26 January 2006 08:59:11 and PASSED the requirements for a valid MOT with 0 comments.

Recorded mileage: 54,397

Recorded mileage: 54,397