265 UXV


265UXV is registered to a Black 1961, Morris Minor 1000 with a Petrol engine. It Failed its most recent MOT Test on the 19 September 2017

24 unique faults (31 Total) reported in its MOT History (9 Tests).

3 common/recurring faults, the most frequent (3 times) is: Brakes imbalanced across an axle (3.7.B.5b).

56% (5) MOT Pass Rate and a 44% (4) MOT Failure Rate.

78,098 recorded miles.

265 UXV


265UXV is registered to a Black 1961, Morris Minor 1000 with a Petrol engine. It Failed its most recent MOT Test on the 19 September 2017

24 unique faults (31 Total) reported in its MOT History (9 Tests).

3 common/recurring faults, the most frequent (3 times) is: Brakes imbalanced across an axle (3.7.B.5b).

56% (5) MOT Pass Rate and a 44% (4) MOT Failure Rate.

78,098 recorded miles.

MOT PASS/Failure rate for 265 UXV

all MOT test results for 265 UXV represented as a percentage
MOT PASS/Failure rate for 265 UXV
all MOT test results for 265 UXV represented as a percentage

PERCENTAGE OF VEHICLE FAULTS WITH 265 UXV

ALL REPORTED FAULTS, DISPLAYED BY PERCENTAGE OF OCCURRENCE DURING ALL MOT TESTS
PERCENTAGE OF VEHICLE FAULTS WITH 265 UXV
ALL REPORTED FAULTS, DISPLAYED BY PERCENTAGE OF OCCURRENCE DURING ALL MOT TESTS
FAIL

USER ENTERED

265 UXV annual Faults by type

ALL REPORTED FAULTS, DISPLAYED over time and categorised by type
265 UXV annual Faults by type
ALL REPORTED FAULTS, DISPLAYED over time and categorised by type

RECURRING FAULTS WITH 265 UXV

FAULTS THAT HAVE OCCURED MORE THAN ONCE DURING 265 UXV's MOT HISTORY
RECURRING FAULTS WITH 265 UXV
FAULTS THAT HAVE OCCURED MORE THAN ONCE DURING 265 UXV's MOT HISTORY
Fault Fault Test Date Test Date/Time Reference MOT Test Reference
3 Brakes imbalanced across an axle (3.7.b.5b) Brakes imbalanced across an axle (3.7.b.5b) 30 August 2017 [15:26] 30/08/2017 30 March 2012 [13:31] 30/03/2012 19 March 2010 [15:34] 19/03/2010 101122879825 101122879825 155560792451 155560792451 823708870067 823708870067
2 Parking brake: efficiency below requirements (3.7.b.7) Parking brake: efficiency below requirements (3.7.b.7) 30 August 2017 [15:26] 30/08/2017 03 July 2007 [10:47] 03/07/2007 101122879825 101122879825 792054787188 792054787188
2 Nearside front steering rack gaiter split (2.2.d.2d) Nearside front steering rack gaiter split (2.2.d.2d) 19 March 2010 [15:34] 19/03/2010 03 July 2007 [10:47] 03/07/2007 823708870067 823708870067 792054787188 792054787188

ALL 265 UXV Failure Faults [30]

ALL Failure faults, ORDERED by OCCURRENCE DURING 265 UXV's MOT HISTORY
ALL 265 UXV Failure Faults [30]
ALL Failure faults, ORDERED by OCCURRENCE DURING 265 UXV's MOT HISTORY
Fail Faults | source www.vehiclestats.co.uk
Fault Fault Test Date Test Date/Time Reference MOT Test Reference
3 Brakes imbalanced across an axle (3.7.b.5b) Brakes imbalanced across an axle (3.7.b.5b) 30 August 2017 [15:26] 30/08/2017 30 March 2012 [13:31] 30/03/2012 19 March 2010 [15:34] 19/03/2010 101122879825 101122879825 155560792451 155560792451 823708870067 823708870067
2 Parking brake: efficiency below requirements (3.7.b.7) Parking brake: efficiency below requirements (3.7.b.7) 30 August 2017 [15:26] 30/08/2017 03 July 2007 [10:47] 03/07/2007 101122879825 101122879825 792054787188 792054787188
2 Nearside front steering rack gaiter split (2.2.d.2d) Nearside front steering rack gaiter split (2.2.d.2d) 19 March 2010 [15:34] 19/03/2010 03 July 2007 [10:47] 03/07/2007 823708870067 823708870067 792054787188 792054787188
1 Offside windscreen washer provides insufficient washer liquid (8.2.3) Offside windscreen washer provides insufficient washer liquid (8.2.3) 30 August 2017 [15:26] 30/08/2017 101122879825 101122879825
1 Service brake: efficiency below requirements (3.7.b.7) Service brake: efficiency below requirements (3.7.b.7) 30 August 2017 [15:26] 30/08/2017 101122879825 101122879825
1 Front brakes imbalanced across an axle (3.7.b.5b) Front brakes imbalanced across an axle (3.7.b.5b) 30 August 2017 [15:26] 30/08/2017 101122879825 101122879825
1 Offside front front wheel bearing rough when rotated (2.5.a.2) Offside front front wheel bearing rough when rotated (2.5.a.2) 30 March 2012 [13:31] 30/03/2012 155560792451 155560792451
1 Nearside rear front wheel bearing rough when rotated (2.5.a.2) Nearside rear front wheel bearing rough when rotated (2.5.a.2) 30 March 2012 [13:31] 30/03/2012 155560792451 155560792451
1 Offside rear front wheel bearing rough when rotated (2.5.a.2) Offside rear front wheel bearing rough when rotated (2.5.a.2) 30 March 2012 [13:31] 30/03/2012 155560792451 155560792451
1 Nearside front front brake recording little or no effort (3.7.b.5a) Nearside front front brake recording little or no effort (3.7.b.5a) 30 March 2012 [13:31] 30/03/2012 155560792451 155560792451
1 Horn not working (1.6.2a) Horn not working (1.6.2a) 19 March 2010 [15:34] 19/03/2010 823708870067 823708870067
1 Windscreen washer provides insufficient washer liquid (8.2.3) Windscreen washer provides insufficient washer liquid (8.2.3) 19 March 2010 [15:34] 19/03/2010 823708870067 823708870067
1 Registration plate lamp not working (1.1.5c) Registration plate lamp not working (1.1.5c) 19 March 2010 [15:34] 19/03/2010 823708870067 823708870067
1 Nearside front upper suspension arm rubber bush deteriorated resulting in excessive movement (2.4.g.2) Nearside front upper suspension arm rubber bush deteriorated resulting in excessive movement (2.4.g.2) 19 March 2010 [15:34] 19/03/2010 823708870067 823708870067
1 Nearside rear suspension spring mounting prescribed area is excessively corroded (2.4.a.3) Nearside rear suspension spring mounting prescribed area is excessively corroded (2.4.a.3) 19 March 2010 [15:34] 19/03/2010 823708870067 823708870067
1 Offside rear suspension spring mounting prescribed area is excessively corroded (2.4.a.3) Offside rear suspension spring mounting prescribed area is excessively corroded (2.4.a.3) 19 March 2010 [15:34] 19/03/2010 823708870067 823708870067
1 Rear brake application uneven (3.7.b.2) Rear brake application uneven (3.7.b.2) 19 March 2010 [15:34] 19/03/2010 823708870067 823708870067
1 Front brake application uneven (3.7.b.2) Front brake application uneven (3.7.b.2) 19 March 2010 [15:34] 19/03/2010 823708870067 823708870067
1 Body or chassis has excessive corrosion, seriously affecting its strength within 30cm of the body mountings (6.1.b.2) Body or chassis has excessive corrosion, seriously affecting its strength within 30cm of the body mountings (6.1.b.2) 03 July 2007 [10:47] 03/07/2007 792054787188 792054787188
1 Nearside rear body or chassis has excessive corrosion, seriously affecting its strength within 30cm of the body mountings (6.1.b.2) Nearside rear body or chassis has excessive corrosion, seriously affecting its strength within 30cm of the body mountings (6.1.b.2) 03 July 2007 [10:47] 03/07/2007 792054787188 792054787188
1 Nearside rear brake recording little or no effort (3.7.b.5a) Nearside rear brake recording little or no effort (3.7.b.5a) 03 July 2007 [10:47] 03/07/2007 792054787188 792054787188
1 Nearside rear rear parking brake recording little or no effort (3.7.b.6a) Nearside rear rear parking brake recording little or no effort (3.7.b.6a) 03 July 2007 [10:47] 03/07/2007 792054787188 792054787188
1 Rear brake hose leaking (3.6.a.1) Rear brake hose leaking (3.6.a.1) 03 July 2007 [10:47] 03/07/2007 792054787188 792054787188

ALL 265 UXV User Entered Faults [1]

ALL User Entered faults, ORDERED by OCCURRENCE DURING 265 UXV's MOT HISTORY
ALL 265 UXV User Entered Faults [1]
ALL User Entered faults, ORDERED by OCCURRENCE DURING 265 UXV's MOT HISTORY
Fail Faults | source www.vehiclestats.co.uk
Fault Fault Test Date Test Date/Time Reference MOT Test Reference
1 Off side rear tyre worn down to 2mm. Off side rear tyre worn down to 2mm. 03 July 2007 [10:47] 03/07/2007 792054787188 792054787188

MOT TEST: 19 September 2017 16:00:49 PASSED
MOT TEST: 19 September 2017 16:00:49 PASSED

This test (929409879652) was completed on the 19 September 2017 16:00:49 and PASSED the requirements for a valid MOT with 0 comments.

This test (929409879652) was completed on the 19 September 2017 16:00:49 and PASSED the requirements for a valid MOT with 0 comments.

Recorded mileage: 78,098

Recorded mileage: 78,098


MOT TEST: 30 August 2017 15:26:35 FAILED
MOT TEST: 30 August 2017 15:26:35 FAILED

This test (101122879825) was completed on the 30 August 2017 15:26:35 and FAILED the requirements for a valid MOT with 5 comments.

This test (101122879825) was completed on the 30 August 2017 15:26:35 and FAILED the requirements for a valid MOT with 5 comments.

Recorded mileage: 78,097

Recorded mileage: 78,097


FAIL


MOT TEST: 10 July 2013 10:36:40 PASSED
MOT TEST: 10 July 2013 10:36:40 PASSED

This test (295191193150) was completed on the 10 July 2013 10:36:40 and PASSED the requirements for a valid MOT with 0 comments.

This test (295191193150) was completed on the 10 July 2013 10:36:40 and PASSED the requirements for a valid MOT with 0 comments.

Recorded mileage: 77,713

Recorded mileage: 77,713


MOT TEST: 10 April 2012 16:32:35 PASSED
MOT TEST: 10 April 2012 16:32:35 PASSED

This test (977541702194) was completed on the 10 April 2012 16:32:35 and PASSED the requirements for a valid MOT with 0 comments.

This test (977541702194) was completed on the 10 April 2012 16:32:35 and PASSED the requirements for a valid MOT with 0 comments.

Recorded mileage: 77,654

Recorded mileage: 77,654


MOT TEST: 30 March 2012 13:31:20 FAILED
MOT TEST: 30 March 2012 13:31:20 FAILED

This test (155560792451) was completed on the 30 March 2012 13:31:20 and FAILED the requirements for a valid MOT with 5 comments.

This test (155560792451) was completed on the 30 March 2012 13:31:20 and FAILED the requirements for a valid MOT with 5 comments.

Recorded mileage: 77,651

Recorded mileage: 77,651


FAIL


MOT TEST: 05 April 2011 17:24:50 PASSED
MOT TEST: 05 April 2011 17:24:50 PASSED

This test (557725291054) was completed on the 05 April 2011 17:24:50 and PASSED the requirements for a valid MOT with 0 comments.

This test (557725291054) was completed on the 05 April 2011 17:24:50 and PASSED the requirements for a valid MOT with 0 comments.

Recorded mileage: 77,333

Recorded mileage: 77,333


MOT TEST: 27 March 2010 12:39:44 PASSED
MOT TEST: 27 March 2010 12:39:44 PASSED

This test (122376880090) was completed on the 27 March 2010 12:39:44 and PASSED the requirements for a valid MOT with 0 comments.

This test (122376880090) was completed on the 27 March 2010 12:39:44 and PASSED the requirements for a valid MOT with 0 comments.

Recorded mileage: 76,759

Recorded mileage: 76,759


MOT TEST: 19 March 2010 15:34:34 FAILED
MOT TEST: 19 March 2010 15:34:34 FAILED

This test (823708870067) was completed on the 19 March 2010 15:34:34 and FAILED the requirements for a valid MOT with 11 comments.

This test (823708870067) was completed on the 19 March 2010 15:34:34 and FAILED the requirements for a valid MOT with 11 comments.

Recorded mileage: 76,757

Recorded mileage: 76,757


FAIL


MOT TEST: 03 July 2007 10:47:31 FAILED
MOT TEST: 03 July 2007 10:47:31 FAILED

This test (792054787188) was completed on the 03 July 2007 10:47:31 and FAILED the requirements for a valid MOT with 10 comments.

This test (792054787188) was completed on the 03 July 2007 10:47:31 and FAILED the requirements for a valid MOT with 10 comments.

Recorded mileage: 76,733

Recorded mileage: 76,733


FAIL

USER ENTERED