271 VPF


271VPF is registered to a Grey 1961, Morris Minor with a Petrol engine. It Failed its most recent MOT Test on the 03 November 2017

30 unique faults (34 Total) reported in its MOT History (16 Tests).

3 common/recurring faults, the most frequent (2 times) is: Nearside Front Vehicle structure has slight corrosion (6.1.B.2).

69% (11) MOT Pass Rate and a 31% (5) MOT Failure Rate.

93,627 recorded miles.

271 VPF


271VPF is registered to a Grey 1961, Morris Minor with a Petrol engine. It Failed its most recent MOT Test on the 03 November 2017

30 unique faults (34 Total) reported in its MOT History (16 Tests).

3 common/recurring faults, the most frequent (2 times) is: Nearside Front Vehicle structure has slight corrosion (6.1.B.2).

69% (11) MOT Pass Rate and a 31% (5) MOT Failure Rate.

93,627 recorded miles.

MOT PASS/Failure rate for 271 VPF

all MOT test results for 271 VPF represented as a percentage
MOT PASS/Failure rate for 271 VPF
all MOT test results for 271 VPF represented as a percentage

PERCENTAGE OF VEHICLE FAULTS WITH 271 VPF

ALL REPORTED FAULTS, DISPLAYED BY PERCENTAGE OF OCCURRENCE DURING ALL MOT TESTS
PERCENTAGE OF VEHICLE FAULTS WITH 271 VPF
ALL REPORTED FAULTS, DISPLAYED BY PERCENTAGE OF OCCURRENCE DURING ALL MOT TESTS
ADVISORY

FAIL

USER ENTERED

PASS WITH RECTIFICATION

271 VPF annual Faults by type

ALL REPORTED FAULTS, DISPLAYED over time and categorised by type
271 VPF annual Faults by type
ALL REPORTED FAULTS, DISPLAYED over time and categorised by type

RECURRING FAULTS WITH 271 VPF

FAULTS THAT HAVE OCCURED MORE THAN ONCE DURING 271 VPF's MOT HISTORY
RECURRING FAULTS WITH 271 VPF
FAULTS THAT HAVE OCCURED MORE THAN ONCE DURING 271 VPF's MOT HISTORY
Fault Fault Test Date Test Date/Time Reference MOT Test Reference
2 Nearside front vehicle structure has slight corrosion (6.1.b.2) Nearside front vehicle structure has slight corrosion (6.1.b.2) 12 February 2013 [10:18] 12/02/2013 11 February 2013 [11:07] 11/02/2013 808623143081 808623143081 298422443053 298422443053
2 Brakes imbalanced across an axle (3.7.b.5b) Brakes imbalanced across an axle (3.7.b.5b) 11 February 2013 [11:07] 11/02/2013 27 August 2008 [10:33] 27/08/2008 298422443053 298422443053 490230748230 490230748230
2 Centre brake pipe slightly corroded (3.6.b.2c) Centre brake pipe slightly corroded (3.6.b.2c) 31 August 2007 [17:04] 31/08/2007 31 August 2007 [17:04] 31/08/2007 552643147212 552643147212 383313147454 383313147454

ALL 271 VPF ADVISORIES [7]

ALL ADVISORIES, ORDERED by OCCURRENCE DURING 271 VPF's MOT HISTORY
ALL 271 VPF ADVISORIES [7]
ALL ADVISORIES, ORDERED by OCCURRENCE DURING 271 VPF's MOT HISTORY
Advisory Faults | source www.vehiclestats.co.uk
Fault Fault Test Date Test Date/Time Reference MOT Test Reference
2 Nearside front vehicle structure has slight corrosion (6.1.b.2) Nearside front vehicle structure has slight corrosion (6.1.b.2) 12 February 2013 [10:18] 12/02/2013 11 February 2013 [11:07] 11/02/2013 808623143081 808623143081 298422443053 298422443053
2 Centre brake pipe slightly corroded (3.6.b.2c) Centre brake pipe slightly corroded (3.6.b.2c) 31 August 2007 [17:04] 31/08/2007 31 August 2007 [17:04] 31/08/2007 552643147212 552643147212 383313147454 383313147454
1 Tyres starting to crack Tyres starting to crack 03 November 2017 [11:21] 03/11/2017 704565137846 704565137846
1 Nearside front steering rack gaiter deteriorated (2.2.d.2d) Nearside front steering rack gaiter deteriorated (2.2.d.2d) 23 May 2014 [15:11] 23/05/2014 308473644193 308473644193
1 Offside rear shock absorber has a light misting of oil (2.7.3) Offside rear shock absorber has a light misting of oil (2.7.3) 26 September 2011 [16:06] 26/09/2011 717559961262 717559961262

ALL 271 VPF Failure Faults [23]

ALL Failure faults, ORDERED by OCCURRENCE DURING 271 VPF's MOT HISTORY
ALL 271 VPF Failure Faults [23]
ALL Failure faults, ORDERED by OCCURRENCE DURING 271 VPF's MOT HISTORY
Fail Faults | source www.vehiclestats.co.uk
Fault Fault Test Date Test Date/Time Reference MOT Test Reference
2 Brakes imbalanced across an axle (3.7.b.5b) Brakes imbalanced across an axle (3.7.b.5b) 11 February 2013 [11:07] 11/02/2013 27 August 2008 [10:33] 27/08/2008 298422443053 298422443053 490230748230 490230748230
1 Front brakes imbalanced across an axle (3.7.b.5b) Front brakes imbalanced across an axle (3.7.b.5b) 29 November 2016 [11:52] 29/11/2016 664546679223 664546679223
1 Exhaust has a major leak of exhaust gases (7.1.2) Exhaust has a major leak of exhaust gases (7.1.2) 29 November 2016 [11:52] 29/11/2016 664546679223 664546679223
1 Semaphore indicator tell tale not working correctly (1.4.c.2) Semaphore indicator tell tale not working correctly (1.4.c.2) 29 November 2016 [11:52] 29/11/2016 664546679223 664546679223
1 Nearside front direction indicators not working (1.4.a.2c) Nearside front direction indicators not working (1.4.a.2c) 29 November 2016 [11:52] 29/11/2016 664546679223 664546679223
1 Offside front direction indicators not working (1.4.a.2c) Offside front direction indicators not working (1.4.a.2c) 29 November 2016 [11:52] 29/11/2016 664546679223 664546679223
1 Nearside rear direction indicators not working (1.4.a.2c) Nearside rear direction indicators not working (1.4.a.2c) 29 November 2016 [11:52] 29/11/2016 664546679223 664546679223
1 Offside rear direction indicators not working (1.4.a.2c) Offside rear direction indicators not working (1.4.a.2c) 29 November 2016 [11:52] 29/11/2016 664546679223 664546679223
1 Nearside stop lamp not working (1.2.1b) Nearside stop lamp not working (1.2.1b) 29 November 2016 [11:52] 29/11/2016 664546679223 664546679223
1 Registration plate lamp not working (1.1.c.1d) Registration plate lamp not working (1.1.c.1d) 29 November 2016 [11:52] 29/11/2016 664546679223 664546679223
1 Nearside steering locking device missing track rod end (2.2.c.1g) Nearside steering locking device missing track rod end (2.2.c.1g) 29 November 2016 [11:52] 29/11/2016 664546679223 664546679223
1 Offside steering rack gaiter split (2.2.d.2d) Offside steering rack gaiter split (2.2.d.2d) 22 September 2009 [11:19] 22/09/2009 552985169286 552985169286
1 Nearside direction indicators not working (1.4.a.2c) Nearside direction indicators not working (1.4.a.2c) 22 September 2009 [11:19] 22/09/2009 552985169286 552985169286
1 Offside direction indicators not working (1.4.a.2c) Offside direction indicators not working (1.4.a.2c) 22 September 2009 [11:19] 22/09/2009 552985169286 552985169286
1 Nearside rear rear brake binding (3.7.b.1) Nearside rear rear brake binding (3.7.b.1) 27 August 2008 [10:33] 27/08/2008 490230748230 490230748230
1 Nearside front front brake recording little or no effort (3.7.b.5a) Nearside front front brake recording little or no effort (3.7.b.5a) 27 August 2008 [10:33] 27/08/2008 490230748230 490230748230
1 Nearside rear suspension spring mounting prescribed area is excessively corroded (2.4.a.3) Nearside rear suspension spring mounting prescribed area is excessively corroded (2.4.a.3) 27 August 2008 [10:33] 27/08/2008 490230748230 490230748230
1 Offside rear suspension spring mounting prescribed area is excessively corroded (2.4.a.3) Offside rear suspension spring mounting prescribed area is excessively corroded (2.4.a.3) 27 August 2008 [10:33] 27/08/2008 490230748230 490230748230
1 Offside front suspension component mounting prescribed area is excessively corroded (2.4.a.3) Offside front suspension component mounting prescribed area is excessively corroded (2.4.a.3) 27 August 2008 [10:33] 27/08/2008 490230748230 490230748230
1 Offside rear position lamp(s) adversely affected by the operation of another lamp (1.1.a.3f) Offside rear position lamp(s) adversely affected by the operation of another lamp (1.1.a.3f) 27 August 2008 [10:33] 27/08/2008 490230748230 490230748230
1 Front windscreen wiper does not clear the windscreen effectively (8.2.2) Front windscreen wiper does not clear the windscreen effectively (8.2.2) 27 August 2008 [10:33] 27/08/2008 490230748230 490230748230

ALL 271 VPF User Entered Faults [1]

ALL User Entered faults, ORDERED by OCCURRENCE DURING 271 VPF's MOT HISTORY
ALL 271 VPF User Entered Faults [1]
ALL User Entered faults, ORDERED by OCCURRENCE DURING 271 VPF's MOT HISTORY
Fail Faults | source www.vehiclestats.co.uk
Fault Fault Test Date Test Date/Time Reference MOT Test Reference
1 Brake pipes rusty Brake pipes rusty 27 August 2008 [10:33] 27/08/2008 490230748230 490230748230

ALL 271 VPF Pass With Rectification Faults [3]

ALL Pass With Rectification faults, ORDERED by OCCURRENCE DURING 271 VPF's MOT HISTORY
ALL 271 VPF Pass With Rectification Faults [3]
ALL Pass With Rectification faults, ORDERED by OCCURRENCE DURING 271 VPF's MOT HISTORY
Pass With Rectification Faults | source www.vehiclestats.co.uk
Fault Fault Test Date Test Date/Time Reference MOT Test Reference
1 Nearside front position lamp(s) not working (1.1.a.3b) Nearside front position lamp(s) not working (1.1.a.3b) 31 August 2007 [17:04] 31/08/2007 552643147212 552643147212
1 Offside rear position lamp(s) excessively deteriorated so that it is not visible from a reasonable distance (1.1.a.3d) Offside rear position lamp(s) excessively deteriorated so that it is not visible from a reasonable distance (1.1.a.3d) 31 August 2007 [17:04] 31/08/2007 552643147212 552643147212
1 Nearside headlamp aim too low (1.8) Nearside headlamp aim too low (1.8) 31 August 2007 [17:04] 31/08/2007 552643147212 552643147212

MOT TEST: 03 November 2017 11:21:23 PASSED
MOT TEST: 03 November 2017 11:21:23 PASSED

This test (704565137846) was completed on the 03 November 2017 11:21:23 and PASSED the requirements for a valid MOT with 1 comments.

This test (704565137846) was completed on the 03 November 2017 11:21:23 and PASSED the requirements for a valid MOT with 1 comments.

Recorded mileage: 93,627

Recorded mileage: 93,627


ADVISORY


MOT TEST: 01 December 2016 15:17:44 PASSED
MOT TEST: 01 December 2016 15:17:44 PASSED

This test (967682632456) was completed on the 01 December 2016 15:17:44 and PASSED the requirements for a valid MOT with 0 comments.

This test (967682632456) was completed on the 01 December 2016 15:17:44 and PASSED the requirements for a valid MOT with 0 comments.

Recorded mileage: 92,295

Recorded mileage: 92,295


MOT TEST: 29 November 2016 11:52:10 FAILED
MOT TEST: 29 November 2016 11:52:10 FAILED

This test (664546679223) was completed on the 29 November 2016 11:52:10 and FAILED the requirements for a valid MOT with 11 comments.

This test (664546679223) was completed on the 29 November 2016 11:52:10 and FAILED the requirements for a valid MOT with 11 comments.

Recorded mileage: 93,224

Recorded mileage: 93,224


FAIL


MOT TEST: 28 November 2015 14:11:47 PASSED
MOT TEST: 28 November 2015 14:11:47 PASSED

This test (279358817480) was completed on the 28 November 2015 14:11:47 and PASSED the requirements for a valid MOT with 0 comments.

This test (279358817480) was completed on the 28 November 2015 14:11:47 and PASSED the requirements for a valid MOT with 0 comments.

Recorded mileage: 92,295

Recorded mileage: 92,295


MOT TEST: 23 May 2014 15:11:37 PASSED
MOT TEST: 23 May 2014 15:11:37 PASSED

This test (308473644193) was completed on the 23 May 2014 15:11:37 and PASSED the requirements for a valid MOT with 1 comments.

This test (308473644193) was completed on the 23 May 2014 15:11:37 and PASSED the requirements for a valid MOT with 1 comments.

Recorded mileage: 91,991

Recorded mileage: 91,991


ADVISORY


MOT TEST: 12 February 2013 10:18:05 PASSED
MOT TEST: 12 February 2013 10:18:05 PASSED

This test (808623143081) was completed on the 12 February 2013 10:18:05 and PASSED the requirements for a valid MOT with 1 comments.

This test (808623143081) was completed on the 12 February 2013 10:18:05 and PASSED the requirements for a valid MOT with 1 comments.

Recorded mileage: 91,016

Recorded mileage: 91,016


ADVISORY


MOT TEST: 11 February 2013 11:07:17 FAILED
MOT TEST: 11 February 2013 11:07:17 FAILED

This test (298422443053) was completed on the 11 February 2013 11:07:17 and FAILED the requirements for a valid MOT with 2 comments.

This test (298422443053) was completed on the 11 February 2013 11:07:17 and FAILED the requirements for a valid MOT with 2 comments.

Recorded mileage: 91,016

Recorded mileage: 91,016


ADVISORY

FAIL


MOT TEST: 26 September 2011 16:06:44 PASSED
MOT TEST: 26 September 2011 16:06:44 PASSED

This test (717559961262) was completed on the 26 September 2011 16:06:44 and PASSED the requirements for a valid MOT with 1 comments.

This test (717559961262) was completed on the 26 September 2011 16:06:44 and PASSED the requirements for a valid MOT with 1 comments.

Recorded mileage: 89,864

Recorded mileage: 89,864


ADVISORY


MOT TEST: 06 September 2010 15:48:59 PASSED
MOT TEST: 06 September 2010 15:48:59 PASSED

This test (751399440248) was completed on the 06 September 2010 15:48:59 and PASSED the requirements for a valid MOT with 0 comments.

This test (751399440248) was completed on the 06 September 2010 15:48:59 and PASSED the requirements for a valid MOT with 0 comments.

Recorded mileage: 89,410

Recorded mileage: 89,410


MOT TEST: 22 September 2009 16:42:04 PASSED
MOT TEST: 22 September 2009 16:42:04 PASSED

This test (982035969210) was completed on the 22 September 2009 16:42:04 and PASSED the requirements for a valid MOT with 0 comments.

This test (982035969210) was completed on the 22 September 2009 16:42:04 and PASSED the requirements for a valid MOT with 0 comments.

Recorded mileage: 89,221

Recorded mileage: 89,221


MOT TEST: 22 September 2009 11:19:33 FAILED
MOT TEST: 22 September 2009 11:19:33 FAILED

This test (552985169286) was completed on the 22 September 2009 11:19:33 and FAILED the requirements for a valid MOT with 3 comments.

This test (552985169286) was completed on the 22 September 2009 11:19:33 and FAILED the requirements for a valid MOT with 3 comments.

Recorded mileage: 89,221

Recorded mileage: 89,221


FAIL


MOT TEST: 05 September 2008 15:29:10 PASSED
MOT TEST: 05 September 2008 15:29:10 PASSED

This test (800219448217) was completed on the 05 September 2008 15:29:10 and PASSED the requirements for a valid MOT with 0 comments.

This test (800219448217) was completed on the 05 September 2008 15:29:10 and PASSED the requirements for a valid MOT with 0 comments.

Recorded mileage: 88,966

Recorded mileage: 88,966


MOT TEST: 27 August 2008 10:33:03 FAILED
MOT TEST: 27 August 2008 10:33:03 FAILED

This test (490230748230) was completed on the 27 August 2008 10:33:03 and FAILED the requirements for a valid MOT with 9 comments.

This test (490230748230) was completed on the 27 August 2008 10:33:03 and FAILED the requirements for a valid MOT with 9 comments.

Recorded mileage: 88,959

Recorded mileage: 88,959


FAIL

USER ENTERED


MOT TEST: 31 August 2007 17:04:44 FAILED
MOT TEST: 31 August 2007 17:04:44 FAILED

This test (552643147212) was completed on the 31 August 2007 17:04:44 and FAILED the requirements for a valid MOT with 4 comments.

This test (552643147212) was completed on the 31 August 2007 17:04:44 and FAILED the requirements for a valid MOT with 4 comments.

Recorded mileage: 88,745

Recorded mileage: 88,745


ADVISORY

PASS WITH RECTIFICATION


MOT TEST: 31 August 2007 17:04:44 PASSED
MOT TEST: 31 August 2007 17:04:44 PASSED

This test (383313147454) was completed on the 31 August 2007 17:04:44 and PASSED the requirements for a valid MOT with 1 comments.

This test (383313147454) was completed on the 31 August 2007 17:04:44 and PASSED the requirements for a valid MOT with 1 comments.

Recorded mileage: 88,745

Recorded mileage: 88,745


ADVISORY


MOT TEST: 07 August 2006 16:57:51 PASSED
MOT TEST: 07 August 2006 16:57:51 PASSED

This test (501039016249) was completed on the 07 August 2006 16:57:51 and PASSED the requirements for a valid MOT with 0 comments.

This test (501039016249) was completed on the 07 August 2006 16:57:51 and PASSED the requirements for a valid MOT with 0 comments.

Recorded mileage: 88,239

Recorded mileage: 88,239