271 YUC


271YUC is registered to a Green 1962, Morris Minor with a Petrol engine. It Passed its most recent MOT Test on the 14 August 2018

24 unique faults (30 Total) reported in its MOT History (12 Tests).

6 common/recurring faults, the most frequent (2 times) is: Nearside Front Track rod end ball joint has slight play (2.1.3 (b) (i)).

67% (8) MOT Pass Rate and a 33% (4) MOT Failure Rate.

46,323 recorded miles.

271 YUC


271YUC is registered to a Green 1962, Morris Minor with a Petrol engine. It Passed its most recent MOT Test on the 14 August 2018

24 unique faults (30 Total) reported in its MOT History (12 Tests).

6 common/recurring faults, the most frequent (2 times) is: Nearside Front Track rod end ball joint has slight play (2.1.3 (b) (i)).

67% (8) MOT Pass Rate and a 33% (4) MOT Failure Rate.

46,323 recorded miles.

MOT PASS/Failure rate for 271 YUC

all MOT test results for 271 YUC represented as a percentage
MOT PASS/Failure rate for 271 YUC
all MOT test results for 271 YUC represented as a percentage

PERCENTAGE OF VEHICLE FAULTS WITH 271 YUC

ALL REPORTED FAULTS, DISPLAYED BY PERCENTAGE OF OCCURRENCE DURING ALL MOT TESTS
PERCENTAGE OF VEHICLE FAULTS WITH 271 YUC
ALL REPORTED FAULTS, DISPLAYED BY PERCENTAGE OF OCCURRENCE DURING ALL MOT TESTS
ADVISORY

FAIL

USER ENTERED

PASS WITH RECTIFICATION

271 YUC annual Faults by type

ALL REPORTED FAULTS, DISPLAYED over time and categorised by type
271 YUC annual Faults by type
ALL REPORTED FAULTS, DISPLAYED over time and categorised by type

RECURRING FAULTS WITH 271 YUC

FAULTS THAT HAVE OCCURED MORE THAN ONCE DURING 271 YUC's MOT HISTORY
RECURRING FAULTS WITH 271 YUC
FAULTS THAT HAVE OCCURED MORE THAN ONCE DURING 271 YUC's MOT HISTORY
Fault Fault Test Date Test Date/Time Reference MOT Test Reference
2 Nearside front track rod end ball joint has slight play (2.1.3 (b) (i)) Nearside front track rod end ball joint has slight play (2.1.3 (b) (i)) 14 August 2018 [15:51] 14/08/2018 14 August 2018 [15:37] 14/08/2018 555461056434 555461056434 174134590202 174134590202
2 Nearside front wheel bearing slightly noisy (5.1.3 (b) (i)) Nearside front wheel bearing slightly noisy (5.1.3 (b) (i)) 14 August 2018 [15:51] 14/08/2018 14 August 2018 [15:37] 14/08/2018 555461056434 555461056434 174134590202 174134590202
2 Registration plate lamp not working (1.1.5c) Registration plate lamp not working (1.1.5c) 03 April 2008 [17:02] 03/04/2008 03 April 2006 [13:12] 03/04/2006 940404098073 940404098073 450413296075 450413296075
2 Offside front wheel bearing has excessive play (2.5.a.3c) Offside front wheel bearing has excessive play (2.5.a.3c) 03 April 2008 [17:02] 03/04/2008 03 April 2006 [13:12] 03/04/2006 940404098073 940404098073 450413296075 450413296075
2 Nearside rear tyre just passed minimum mot requirments Nearside rear tyre just passed minimum mot requirments 03 April 2007 [17:04] 03/04/2007 03 April 2007 [17:04] 03/04/2007 294323697056 294323697056 403503097058 403503097058
2 Some suspension bushes weak and perished Some suspension bushes weak and perished 03 April 2007 [17:04] 03/04/2007 03 April 2007 [17:04] 03/04/2007 294323697056 294323697056 403503097058 403503097058

ALL 271 YUC ADVISORIES [7]

ALL ADVISORIES, ORDERED by OCCURRENCE DURING 271 YUC's MOT HISTORY
ALL 271 YUC ADVISORIES [7]
ALL ADVISORIES, ORDERED by OCCURRENCE DURING 271 YUC's MOT HISTORY
Advisory Faults | source www.vehiclestats.co.uk
Fault Fault Test Date Test Date/Time Reference MOT Test Reference
2 Nearside front track rod end ball joint has slight play (2.1.3 (b) (i)) Nearside front track rod end ball joint has slight play (2.1.3 (b) (i)) 14 August 2018 [15:51] 14/08/2018 14 August 2018 [15:37] 14/08/2018 555461056434 555461056434 174134590202 174134590202
2 Nearside front wheel bearing slightly noisy (5.1.3 (b) (i)) Nearside front wheel bearing slightly noisy (5.1.3 (b) (i)) 14 August 2018 [15:51] 14/08/2018 14 August 2018 [15:37] 14/08/2018 555461056434 555461056434 174134590202 174134590202
1 Nearside track rod end ball joint has slight play (2.2.b.1f) Nearside track rod end ball joint has slight play (2.2.b.1f) 22 August 2017 [11:00] 22/08/2017 545778404417 545778404417
1 Offside track rod end ball joint has slight play (2.2.b.1f) Offside track rod end ball joint has slight play (2.2.b.1f) 22 August 2017 [11:00] 22/08/2017 545778404417 545778404417
1 Nearside front wheel bearing rough Nearside front wheel bearing rough 22 August 2017 [11:00] 22/08/2017 545778404417 545778404417

ALL 271 YUC Failure Faults [18]

ALL Failure faults, ORDERED by OCCURRENCE DURING 271 YUC's MOT HISTORY
ALL 271 YUC Failure Faults [18]
ALL Failure faults, ORDERED by OCCURRENCE DURING 271 YUC's MOT HISTORY
Fail Faults | source www.vehiclestats.co.uk
Fault Fault Test Date Test Date/Time Reference MOT Test Reference
2 Registration plate lamp not working (1.1.5c) Registration plate lamp not working (1.1.5c) 03 April 2008 [17:02] 03/04/2008 03 April 2006 [13:12] 03/04/2006 940404098073 940404098073 450413296075 450413296075
2 Offside front wheel bearing has excessive play (2.5.a.3c) Offside front wheel bearing has excessive play (2.5.a.3c) 03 April 2008 [17:02] 03/04/2008 03 April 2006 [13:12] 03/04/2006 940404098073 940404098073 450413296075 450413296075
1 Nearside headlamp aim too high (4.1.2 (a)) Nearside headlamp aim too high (4.1.2 (a)) 14 August 2018 [15:37] 14/08/2018 174134590202 174134590202
1 Direction indicators flashing more than 120 times a minute (1.4.a.2g) Direction indicators flashing more than 120 times a minute (1.4.a.2g) 03 April 2008 [17:02] 03/04/2008 940404098073 940404098073
1 Nearside indicator tell tale inoperative (1.4.a.2a) Nearside indicator tell tale inoperative (1.4.a.2a) 03 April 2008 [17:02] 03/04/2008 940404098073 940404098073
1 Offside indicator tell tale inoperative (1.4.a.2a) Offside indicator tell tale inoperative (1.4.a.2a) 03 April 2008 [17:02] 03/04/2008 940404098073 940404098073
1 Nearside rear braking system leaking (3.6.a.1) Nearside rear braking system leaking (3.6.a.1) 03 April 2008 [17:02] 03/04/2008 940404098073 940404098073
1 Offside rear braking system leaking (3.6.a.1) Offside rear braking system leaking (3.6.a.1) 03 April 2008 [17:02] 03/04/2008 940404098073 940404098073
1 Service brake: efficiency below requirements (3.7.b.7) Service brake: efficiency below requirements (3.7.b.7) 03 April 2008 [17:02] 03/04/2008 940404098073 940404098073
1 Parking brake: efficiency below requirements (3.7.b.7) Parking brake: efficiency below requirements (3.7.b.7) 03 April 2008 [17:02] 03/04/2008 940404098073 940404098073
1 Nearside headlamp aim beam image too far to the left (1.6.b4) Nearside headlamp aim beam image too far to the left (1.6.b4) 03 April 2006 [13:12] 03/04/2006 450413296075 450413296075
1 Nearside front suspension arm rubber bush deteriorated resulting in excessive movement (2.4.g.2) Nearside front suspension arm rubber bush deteriorated resulting in excessive movement (2.4.g.2) 03 April 2006 [13:12] 03/04/2006 450413296075 450413296075
1 Offside front suspension arm rubber bush deteriorated resulting in excessive movement (2.4.g.2) Offside front suspension arm rubber bush deteriorated resulting in excessive movement (2.4.g.2) 03 April 2006 [13:12] 03/04/2006 450413296075 450413296075
1 Offside front tyre tread depth below requirements of 1.6mm (4.1.e.1) Offside front tyre tread depth below requirements of 1.6mm (4.1.e.1) 03 April 2006 [13:12] 03/04/2006 450413296075 450413296075
1 Nearside rear brake binding (3.7.b.1) Nearside rear brake binding (3.7.b.1) 03 April 2006 [13:12] 03/04/2006 450413296075 450413296075
1 Exhaust has a major leak of exhaust gases (7.1.2) Exhaust has a major leak of exhaust gases (7.1.2) 03 April 2006 [13:12] 03/04/2006 450413296075 450413296075

ALL 271 YUC User Entered Faults [4]

ALL User Entered faults, ORDERED by OCCURRENCE DURING 271 YUC's MOT HISTORY
ALL 271 YUC User Entered Faults [4]
ALL User Entered faults, ORDERED by OCCURRENCE DURING 271 YUC's MOT HISTORY
User Entered Faults | source www.vehiclestats.co.uk
Fault Fault Test Date Test Date/Time Reference MOT Test Reference
2 Nearside rear tyre just passed minimum mot requirments Nearside rear tyre just passed minimum mot requirments 03 April 2007 [17:04] 03/04/2007 03 April 2007 [17:04] 03/04/2007 294323697056 294323697056 403503097058 403503097058
2 Some suspension bushes weak and perished Some suspension bushes weak and perished 03 April 2007 [17:04] 03/04/2007 03 April 2007 [17:04] 03/04/2007 294323697056 294323697056 403503097058 403503097058

ALL 271 YUC Pass With Rectification Faults [1]

ALL Pass With Rectification faults, ORDERED by OCCURRENCE DURING 271 YUC's MOT HISTORY
ALL 271 YUC Pass With Rectification Faults [1]
ALL Pass With Rectification faults, ORDERED by OCCURRENCE DURING 271 YUC's MOT HISTORY
Pass With Rectification Faults | source www.vehiclestats.co.uk
Fault Fault Test Date Test Date/Time Reference MOT Test Reference
1 Nearside front position lamp(s) not working (1.1.a.3b) Nearside front position lamp(s) not working (1.1.a.3b) 03 April 2007 [17:04] 03/04/2007 403503097058 403503097058

MOT TEST: 14 August 2018 15:51:31 PASSED
MOT TEST: 14 August 2018 15:51:31 PASSED

This test (555461056434) was completed on the 14 August 2018 15:51:31 and PASSED the requirements for a valid MOT with 2 comments.

This test (555461056434) was completed on the 14 August 2018 15:51:31 and PASSED the requirements for a valid MOT with 2 comments.

Recorded mileage: 46,323

Recorded mileage: 46,323


ADVISORY


MOT TEST: 14 August 2018 15:37:54 FAILED
MOT TEST: 14 August 2018 15:37:54 FAILED

This test (174134590202) was completed on the 14 August 2018 15:37:54 and FAILED the requirements for a valid MOT with 3 comments.

This test (174134590202) was completed on the 14 August 2018 15:37:54 and FAILED the requirements for a valid MOT with 3 comments.

Recorded mileage: 46,323

Recorded mileage: 46,323


ADVISORY

FAIL


MOT TEST: 22 August 2017 11:00:39 PASSED
MOT TEST: 22 August 2017 11:00:39 PASSED

This test (545778404417) was completed on the 22 August 2017 11:00:39 and PASSED the requirements for a valid MOT with 3 comments.

This test (545778404417) was completed on the 22 August 2017 11:00:39 and PASSED the requirements for a valid MOT with 3 comments.

Recorded mileage: 46,314

Recorded mileage: 46,314


ADVISORY


MOT TEST: 26 July 2016 10:43:57 PASSED
MOT TEST: 26 July 2016 10:43:57 PASSED

This test (195842563232) was completed on the 26 July 2016 10:43:57 and PASSED the requirements for a valid MOT with 0 comments.

This test (195842563232) was completed on the 26 July 2016 10:43:57 and PASSED the requirements for a valid MOT with 0 comments.

Recorded mileage: 45,844

Recorded mileage: 45,844


MOT TEST: 04 August 2015 10:16:18 PASSED
MOT TEST: 04 August 2015 10:16:18 PASSED

This test (764620094884) was completed on the 04 August 2015 10:16:18 and PASSED the requirements for a valid MOT with 0 comments.

This test (764620094884) was completed on the 04 August 2015 10:16:18 and PASSED the requirements for a valid MOT with 0 comments.

Recorded mileage: 45,656

Recorded mileage: 45,656


MOT TEST: 08 August 2014 16:16:02 PASSED
MOT TEST: 08 August 2014 16:16:02 PASSED

This test (758310824219) was completed on the 08 August 2014 16:16:02 and PASSED the requirements for a valid MOT with 0 comments.

This test (758310824219) was completed on the 08 August 2014 16:16:02 and PASSED the requirements for a valid MOT with 0 comments.

Recorded mileage: 45,554

Recorded mileage: 45,554


MOT TEST: 04 April 2008 17:28:03 PASSED
MOT TEST: 04 April 2008 17:28:03 PASSED

This test (691135798089) was completed on the 04 April 2008 17:28:03 and PASSED the requirements for a valid MOT with 0 comments.

This test (691135798089) was completed on the 04 April 2008 17:28:03 and PASSED the requirements for a valid MOT with 0 comments.

Recorded mileage: 41,447

Recorded mileage: 41,447


MOT TEST: 03 April 2008 17:02:54 FAILED
MOT TEST: 03 April 2008 17:02:54 FAILED

This test (940404098073) was completed on the 03 April 2008 17:02:54 and FAILED the requirements for a valid MOT with 9 comments.

This test (940404098073) was completed on the 03 April 2008 17:02:54 and FAILED the requirements for a valid MOT with 9 comments.

Recorded mileage: 41,447

Recorded mileage: 41,447


FAIL


MOT TEST: 03 April 2007 17:04:36 PASSED
MOT TEST: 03 April 2007 17:04:36 PASSED

This test (294323697056) was completed on the 03 April 2007 17:04:36 and PASSED the requirements for a valid MOT with 2 comments.

This test (294323697056) was completed on the 03 April 2007 17:04:36 and PASSED the requirements for a valid MOT with 2 comments.

Recorded mileage: 34,708

Recorded mileage: 34,708


USER ENTERED


MOT TEST: 03 April 2007 17:04:36 FAILED
MOT TEST: 03 April 2007 17:04:36 FAILED

This test (403503097058) was completed on the 03 April 2007 17:04:36 and FAILED the requirements for a valid MOT with 3 comments.

This test (403503097058) was completed on the 03 April 2007 17:04:36 and FAILED the requirements for a valid MOT with 3 comments.

Recorded mileage: 34,708

Recorded mileage: 34,708


USER ENTERED

PASS WITH RECTIFICATION


MOT TEST: 04 April 2006 14:37:26 PASSED
MOT TEST: 04 April 2006 14:37:26 PASSED

This test (610014696078) was completed on the 04 April 2006 14:37:26 and PASSED the requirements for a valid MOT with 0 comments.

This test (610014696078) was completed on the 04 April 2006 14:37:26 and PASSED the requirements for a valid MOT with 0 comments.

Recorded mileage: 33,874

Recorded mileage: 33,874


MOT TEST: 03 April 2006 13:12:27 FAILED
MOT TEST: 03 April 2006 13:12:27 FAILED

This test (450413296075) was completed on the 03 April 2006 13:12:27 and FAILED the requirements for a valid MOT with 8 comments.

This test (450413296075) was completed on the 03 April 2006 13:12:27 and FAILED the requirements for a valid MOT with 8 comments.

Recorded mileage: 33,850

Recorded mileage: 33,850


FAIL