272 5RU


2725RU is registered to a Grey 1963, Morris Minor 1000 with a Petrol engine. It Failed its most recent MOT Test on the 21 May 2015

13 unique faults (13 Total) reported in its MOT History (6 Tests).

0 common/recurring faults.

83% (5) MOT Pass Rate and a 17% (1) MOT Failure Rate.

761,813 recorded miles.

272 5RU


2725RU is registered to a Grey 1963, Morris Minor 1000 with a Petrol engine. It Failed its most recent MOT Test on the 21 May 2015

13 unique faults (13 Total) reported in its MOT History (6 Tests).

0 common/recurring faults.

83% (5) MOT Pass Rate and a 17% (1) MOT Failure Rate.

761,813 recorded miles.

MOT PASS/Failure rate for 272 5RU

all MOT test results for 272 5RU represented as a percentage
MOT PASS/Failure rate for 272 5RU
all MOT test results for 272 5RU represented as a percentage

PERCENTAGE OF VEHICLE FAULTS WITH 272 5RU

ALL REPORTED FAULTS, DISPLAYED BY PERCENTAGE OF OCCURRENCE DURING ALL MOT TESTS
PERCENTAGE OF VEHICLE FAULTS WITH 272 5RU
ALL REPORTED FAULTS, DISPLAYED BY PERCENTAGE OF OCCURRENCE DURING ALL MOT TESTS
ADVISORY

FAIL

USER ENTERED

272 5RU annual Faults by type

ALL REPORTED FAULTS, DISPLAYED over time and categorised by type
272 5RU annual Faults by type
ALL REPORTED FAULTS, DISPLAYED over time and categorised by type

ALL 272 5RU ADVISORIES [3]

ALL ADVISORIES, ORDERED by OCCURRENCE DURING 272 5RU's MOT HISTORY
ALL 272 5RU ADVISORIES [3]
ALL ADVISORIES, ORDERED by OCCURRENCE DURING 272 5RU's MOT HISTORY
Fail Faults | source www.vehiclestats.co.uk
Fault Fault Test Date Test Date/Time Reference MOT Test Reference
1 Offside vehicle structure has slight corrosion (6.1.a.1) Offside vehicle structure has slight corrosion (6.1.a.1) 04 May 2013 [10:39] 04/05/2013 695194623168 695194623168
1 Nearside front front wheel bearing has slight play (2.5.a.3c) Nearside front front wheel bearing has slight play (2.5.a.3c) 14 October 2011 [08:50] 14/10/2011 839327381295 839327381295
1 Offside rear vehicle structure has slight corrosion (6.1.b.2) Offside rear vehicle structure has slight corrosion (6.1.b.2) 14 October 2011 [08:50] 14/10/2011 839327381295 839327381295

ALL 272 5RU Failure Faults [8]

ALL Failure faults, ORDERED by OCCURRENCE DURING 272 5RU's MOT HISTORY
ALL 272 5RU Failure Faults [8]
ALL Failure faults, ORDERED by OCCURRENCE DURING 272 5RU's MOT HISTORY
Fail Faults | source www.vehiclestats.co.uk
Fault Fault Test Date Test Date/Time Reference MOT Test Reference
1 Service brake: efficiency below requirements (3.7.b.7) Service brake: efficiency below requirements (3.7.b.7) 04 May 2013 [10:39] 04/05/2013 695194623168 695194623168
1 Parking brake: efficiency below requirements (3.7.b.7) Parking brake: efficiency below requirements (3.7.b.7) 04 May 2013 [10:39] 04/05/2013 695194623168 695194623168
1 Nearside rear brake recording little or no effort (3.7.b.5a) Nearside rear brake recording little or no effort (3.7.b.5a) 04 May 2013 [10:39] 04/05/2013 695194623168 695194623168
1 Offside rear brake recording little or no effort (3.7.b.5a) Offside rear brake recording little or no effort (3.7.b.5a) 04 May 2013 [10:39] 04/05/2013 695194623168 695194623168
1 Nearside rear parking brake recording little or no effort (3.7.b.6a) Nearside rear parking brake recording little or no effort (3.7.b.6a) 04 May 2013 [10:39] 04/05/2013 695194623168 695194623168
1 Offside rear parking brake recording little or no effort (3.7.b.6a) Offside rear parking brake recording little or no effort (3.7.b.6a) 04 May 2013 [10:39] 04/05/2013 695194623168 695194623168
1 Rear braking system leaking (3.6.a.1) Rear braking system leaking (3.6.a.1) 04 May 2013 [10:39] 04/05/2013 695194623168 695194623168
1 Nearside vehicle structure has excessive corrosion which adversely affects braking or steering (6.1.a.1) Nearside vehicle structure has excessive corrosion which adversely affects braking or steering (6.1.a.1) 04 May 2013 [10:39] 04/05/2013 695194623168 695194623168

ALL 272 5RU User Entered Faults [2]

ALL User Entered faults, ORDERED by OCCURRENCE DURING 272 5RU's MOT HISTORY
ALL 272 5RU User Entered Faults [2]
ALL User Entered faults, ORDERED by OCCURRENCE DURING 272 5RU's MOT HISTORY
User Entered Faults | source www.vehiclestats.co.uk
Fault Fault Test Date Test Date/Time Reference MOT Test Reference
1 Slight corrosion o/s/f inner wing Slight corrosion o/s/f inner wing 21 May 2015 [11:41] 21/05/2015 818641045135 818641045135
1 Slight noise offside front wheel bearing Slight noise offside front wheel bearing 24 May 2014 [09:50] 24/05/2014 567004344179 567004344179

MOT TEST: 21 May 2015 11:41:21 PASSED
MOT TEST: 21 May 2015 11:41:21 PASSED

This test (818641045135) was completed on the 21 May 2015 11:41:21 and PASSED the requirements for a valid MOT with 1 comments.

This test (818641045135) was completed on the 21 May 2015 11:41:21 and PASSED the requirements for a valid MOT with 1 comments.

Recorded mileage: 1,783

Recorded mileage: 1,783


USER ENTERED


MOT TEST: 24 May 2014 09:50:41 PASSED
MOT TEST: 24 May 2014 09:50:41 PASSED

This test (567004344179) was completed on the 24 May 2014 09:50:41 and PASSED the requirements for a valid MOT with 1 comments.

This test (567004344179) was completed on the 24 May 2014 09:50:41 and PASSED the requirements for a valid MOT with 1 comments.

Recorded mileage: 1,769

Recorded mileage: 1,769


USER ENTERED


MOT TEST: 11 May 2013 10:59:48 PASSED
MOT TEST: 11 May 2013 10:59:48 PASSED

This test (259651733191) was completed on the 11 May 2013 10:59:48 and PASSED the requirements for a valid MOT with 0 comments.

This test (259651733191) was completed on the 11 May 2013 10:59:48 and PASSED the requirements for a valid MOT with 0 comments.

Recorded mileage: 1,415

Recorded mileage: 1,415


MOT TEST: 04 May 2013 10:39:42 FAILED
MOT TEST: 04 May 2013 10:39:42 FAILED

This test (695194623168) was completed on the 04 May 2013 10:39:42 and FAILED the requirements for a valid MOT with 9 comments.

This test (695194623168) was completed on the 04 May 2013 10:39:42 and FAILED the requirements for a valid MOT with 9 comments.

Recorded mileage: 1,415

Recorded mileage: 1,415


ADVISORY

FAIL


MOT TEST: 14 October 2011 08:50:04 PASSED
MOT TEST: 14 October 2011 08:50:04 PASSED

This test (839327381295) was completed on the 14 October 2011 08:50:04 and PASSED the requirements for a valid MOT with 2 comments.

This test (839327381295) was completed on the 14 October 2011 08:50:04 and PASSED the requirements for a valid MOT with 2 comments.

Recorded mileage: 795

Recorded mileage: 795


ADVISORY


MOT TEST: 25 September 2010 10:38:14 PASSED
MOT TEST: 25 September 2010 10:38:14 PASSED

This test (704298060262) was completed on the 25 September 2010 10:38:14 and PASSED the requirements for a valid MOT with 0 comments.

This test (704298060262) was completed on the 25 September 2010 10:38:14 and PASSED the requirements for a valid MOT with 0 comments.

Recorded mileage: 761,813

Recorded mileage: 761,813