274 BOT


274BOT is registered to a Blue 1961, Morris Minor 1000 with a Petrol engine. It Failed its most recent MOT Test on the 26 March 2013

5 unique faults (7 Total) reported in its MOT History (3 Tests).

2 common/recurring faults, the most frequent (2 times) is: Nearside Front wheel bearing has slight play (2.5.A.3c).

67% (2) MOT Pass Rate and a 33% (1) MOT Failure Rate.

94,866 recorded miles.

274 BOT


274BOT is registered to a Blue 1961, Morris Minor 1000 with a Petrol engine. It Failed its most recent MOT Test on the 26 March 2013

5 unique faults (7 Total) reported in its MOT History (3 Tests).

2 common/recurring faults, the most frequent (2 times) is: Nearside Front wheel bearing has slight play (2.5.A.3c).

67% (2) MOT Pass Rate and a 33% (1) MOT Failure Rate.

94,866 recorded miles.

MOT PASS/Failure rate for 274 BOT

all MOT test results for 274 BOT represented as a percentage
MOT PASS/Failure rate for 274 BOT
all MOT test results for 274 BOT represented as a percentage

PERCENTAGE OF VEHICLE FAULTS WITH 274 BOT

ALL REPORTED FAULTS, DISPLAYED BY PERCENTAGE OF OCCURRENCE DURING ALL MOT TESTS
PERCENTAGE OF VEHICLE FAULTS WITH 274 BOT
ALL REPORTED FAULTS, DISPLAYED BY PERCENTAGE OF OCCURRENCE DURING ALL MOT TESTS
ADVISORY

FAIL

USER ENTERED

274 BOT annual Faults by type

ALL REPORTED FAULTS, DISPLAYED over time and categorised by type
274 BOT annual Faults by type
ALL REPORTED FAULTS, DISPLAYED over time and categorised by type

RECURRING FAULTS WITH 274 BOT

FAULTS THAT HAVE OCCURED MORE THAN ONCE DURING 274 BOT's MOT HISTORY
RECURRING FAULTS WITH 274 BOT
FAULTS THAT HAVE OCCURED MORE THAN ONCE DURING 274 BOT's MOT HISTORY
Fault Fault Test Date Test Date/Time Reference MOT Test Reference
2 Nearside front wheel bearing has slight play (2.5.a.3c) Nearside front wheel bearing has slight play (2.5.a.3c) 26 March 2013 [09:54] 26/03/2013 25 March 2013 [11:05] 25/03/2013 999975383093 999975383093 619044283014 619044283014
2 Offside rear torque/reaction arm has slight play in a ball joint (2.4.g.2) Offside rear torque/reaction arm has slight play in a ball joint (2.4.g.2) 26 March 2013 [09:54] 26/03/2013 25 March 2013 [11:05] 25/03/2013 999975383093 999975383093 619044283014 619044283014

ALL 274 BOT ADVISORIES [4]

ALL ADVISORIES, ORDERED by OCCURRENCE DURING 274 BOT's MOT HISTORY
ALL 274 BOT ADVISORIES [4]
ALL ADVISORIES, ORDERED by OCCURRENCE DURING 274 BOT's MOT HISTORY
Advisory Faults | source www.vehiclestats.co.uk
Fault Fault Test Date Test Date/Time Reference MOT Test Reference
2 Nearside front wheel bearing has slight play (2.5.a.3c) Nearside front wheel bearing has slight play (2.5.a.3c) 26 March 2013 [09:54] 26/03/2013 25 March 2013 [11:05] 25/03/2013 999975383093 999975383093 619044283014 619044283014
2 Offside rear torque/reaction arm has slight play in a ball joint (2.4.g.2) Offside rear torque/reaction arm has slight play in a ball joint (2.4.g.2) 26 March 2013 [09:54] 26/03/2013 25 March 2013 [11:05] 25/03/2013 999975383093 999975383093 619044283014 619044283014

ALL 274 BOT Failure Faults [2]

ALL Failure faults, ORDERED by OCCURRENCE DURING 274 BOT's MOT HISTORY
ALL 274 BOT Failure Faults [2]
ALL Failure faults, ORDERED by OCCURRENCE DURING 274 BOT's MOT HISTORY
Fail Faults | source www.vehiclestats.co.uk
Fault Fault Test Date Test Date/Time Reference MOT Test Reference
1 Offside steering rack gaiter split (2.2.d.2d) Offside steering rack gaiter split (2.2.d.2d) 25 March 2013 [11:05] 25/03/2013 619044283014 619044283014
1 Offside front position lamp(s) not working (1.1.a.3b) Offside front position lamp(s) not working (1.1.a.3b) 25 March 2013 [11:05] 25/03/2013 619044283014 619044283014

ALL 274 BOT User Entered Faults [1]

ALL User Entered faults, ORDERED by OCCURRENCE DURING 274 BOT's MOT HISTORY
ALL 274 BOT User Entered Faults [1]
ALL User Entered faults, ORDERED by OCCURRENCE DURING 274 BOT's MOT HISTORY
Fail Faults | source www.vehiclestats.co.uk
Fault Fault Test Date Test Date/Time Reference MOT Test Reference
1 Prop-shaft flange bolt(s) loose/missing Prop-shaft flange bolt(s) loose/missing 25 March 2013 [11:05] 25/03/2013 619044283014 619044283014

MOT TEST: 26 March 2013 09:54:39 PASSED
MOT TEST: 26 March 2013 09:54:39 PASSED

This test (999975383093) was completed on the 26 March 2013 09:54:39 and PASSED the requirements for a valid MOT with 2 comments.

This test (999975383093) was completed on the 26 March 2013 09:54:39 and PASSED the requirements for a valid MOT with 2 comments.

Recorded mileage: 94,866

Recorded mileage: 94,866


ADVISORY


MOT TEST: 25 March 2013 11:05:53 FAILED
MOT TEST: 25 March 2013 11:05:53 FAILED

This test (619044283014) was completed on the 25 March 2013 11:05:53 and FAILED the requirements for a valid MOT with 5 comments.

This test (619044283014) was completed on the 25 March 2013 11:05:53 and FAILED the requirements for a valid MOT with 5 comments.

Recorded mileage: 94,827

Recorded mileage: 94,827


ADVISORY

FAIL

USER ENTERED


MOT TEST: 07 March 2012 10:03:29 PASSED
MOT TEST: 07 March 2012 10:03:29 PASSED

This test (495897062097) was completed on the 07 March 2012 10:03:29 and PASSED the requirements for a valid MOT with 0 comments.

This test (495897062097) was completed on the 07 March 2012 10:03:29 and PASSED the requirements for a valid MOT with 0 comments.

Recorded mileage: 94,395

Recorded mileage: 94,395