274 CVB


274CVB is registered to a Red 1964, Morris Mini with a Petrol engine. It Passed its most recent MOT Test on the 05 January 2019

23 unique faults (23 Total) reported in its MOT History (9 Tests).

0 common/recurring faults.

67% (6) MOT Pass Rate and a 33% (3) MOT Failure Rate.

30,621 recorded miles.

274 CVB


274CVB is registered to a Red 1964, Morris Mini with a Petrol engine. It Passed its most recent MOT Test on the 05 January 2019

23 unique faults (23 Total) reported in its MOT History (9 Tests).

0 common/recurring faults.

67% (6) MOT Pass Rate and a 33% (3) MOT Failure Rate.

30,621 recorded miles.

MOT PASS/Failure rate for 274 CVB

all MOT test results for 274 CVB represented as a percentage
MOT PASS/Failure rate for 274 CVB
all MOT test results for 274 CVB represented as a percentage

PERCENTAGE OF VEHICLE FAULTS WITH 274 CVB

ALL REPORTED FAULTS, DISPLAYED BY PERCENTAGE OF OCCURRENCE DURING ALL MOT TESTS
PERCENTAGE OF VEHICLE FAULTS WITH 274 CVB
ALL REPORTED FAULTS, DISPLAYED BY PERCENTAGE OF OCCURRENCE DURING ALL MOT TESTS
ADVISORY

FAIL

USER ENTERED

274 CVB annual Faults by type

ALL REPORTED FAULTS, DISPLAYED over time and categorised by type
274 CVB annual Faults by type
ALL REPORTED FAULTS, DISPLAYED over time and categorised by type

ALL 274 CVB ADVISORIES [5]

ALL ADVISORIES, ORDERED by OCCURRENCE DURING 274 CVB's MOT HISTORY
ALL 274 CVB ADVISORIES [5]
ALL ADVISORIES, ORDERED by OCCURRENCE DURING 274 CVB's MOT HISTORY
Advisory Faults | source www.vehiclestats.co.uk
Fault Fault Test Date Test Date/Time Reference MOT Test Reference
1 Oil leak, but not excessive (8.4.1 (a) (i)) Oil leak, but not excessive (8.4.1 (a) (i)) 05 January 2019 [09:21] 05/01/2019 683680786833 683680786833
1 Offside front integral body structure or chassis corroded within 30cm of a mounting, but not seriously affecting overall security floor. (6.2.2 (d) (i)) Offside front integral body structure or chassis corroded within 30cm of a mounting, but not seriously affecting overall security floor. (6.2.2 (d) (i)) 03 September 2018 [16:25] 03/09/2018 294865907435 294865907435
1 Coolant leak heater matrix () Coolant leak heater matrix () 12 June 2017 [09:05] 12/06/2017 989487518791 989487518791
1 Tyre worn close to the legal limit both fronts (4.1.e.1) Tyre worn close to the legal limit both fronts (4.1.e.1) 12 June 2017 [09:05] 12/06/2017 989487518791 989487518791
1 Offside front constant velocity joint gaiter deteriorated (2.5.c.1a) Offside front constant velocity joint gaiter deteriorated (2.5.c.1a) 09 April 2009 [10:05] 09/04/2009 711739499004 711739499004

ALL 274 CVB Failure Faults [17]

ALL Failure faults, ORDERED by OCCURRENCE DURING 274 CVB's MOT HISTORY
ALL 274 CVB Failure Faults [17]
ALL Failure faults, ORDERED by OCCURRENCE DURING 274 CVB's MOT HISTORY
Advisory Faults | source www.vehiclestats.co.uk
Fault Fault Test Date Test Date/Time Reference MOT Test Reference
1 Brake performance not tested (1.2.1 (g)) Brake performance not tested (1.2.1 (g)) 03 September 2018 [16:25] 03/09/2018 294865907435 294865907435
1 Offside rear service brake excessively binding (1.2.1 (f)) Offside rear service brake excessively binding (1.2.1 (f)) 03 September 2018 [16:25] 03/09/2018 294865907435 294865907435
1 Nearside front suspension arm ball joint excessively worn (5.3.4 (a) (i)) Nearside front suspension arm ball joint excessively worn (5.3.4 (a) (i)) 03 September 2018 [16:25] 03/09/2018 294865907435 294865907435
1 Nearside rear suspension component pin or bush excessively worn (5.3.4 (a) (i)) Nearside rear suspension component pin or bush excessively worn (5.3.4 (a) (i)) 03 September 2018 [16:25] 03/09/2018 294865907435 294865907435
1 Exhaust emissions carbon monoxide content excessive (8.2.1.2 (b)) Exhaust emissions carbon monoxide content excessive (8.2.1.2 (b)) 03 September 2018 [16:25] 03/09/2018 294865907435 294865907435
1 Front position lamp(s) not working (1.1.a.3b) Front position lamp(s) not working (1.1.a.3b) 12 June 2017 [09:05] 12/06/2017 989487518791 989487518791
1 Stop lamp not working both (1.2.1b) Stop lamp not working both (1.2.1b) 12 June 2017 [09:05] 12/06/2017 989487518791 989487518791
1 Offside headlamp aim too high (1.8) Offside headlamp aim too high (1.8) 12 June 2017 [09:05] 12/06/2017 989487518791 989487518791
1 Front passenger door cannot be opened from inside the vehicle (6.2.b.1b) Front passenger door cannot be opened from inside the vehicle (6.2.b.1b) 12 June 2017 [09:05] 12/06/2017 989487518791 989487518791
1 Drivers door cannot be opened from inside the vehicle (6.2.b.1b) Drivers door cannot be opened from inside the vehicle (6.2.b.1b) 12 June 2017 [09:05] 12/06/2017 989487518791 989487518791
1 Offside steering rack gaiter split (2.2.d.2d) Offside steering rack gaiter split (2.2.d.2d) 12 June 2017 [09:05] 12/06/2017 989487518791 989487518791
1 Offside front constant velocity joint gaiter split (2.5.c.1a) Offside front constant velocity joint gaiter split (2.5.c.1a) 13 July 2010 [13:09] 13/07/2010 144024990168 144024990168
1 Nearside front constant velocity joint is insecure (2.5.c.1b) Nearside front constant velocity joint is insecure (2.5.c.1b) 13 July 2010 [13:09] 13/07/2010 144024990168 144024990168
1 Registration plate lamp not working (1.1.c.1d) Registration plate lamp not working (1.1.c.1d) 13 July 2010 [13:09] 13/07/2010 144024990168 144024990168
1 Rear fuel pipe leaking (7.2.3) Rear fuel pipe leaking (7.2.3) 13 July 2010 [13:09] 13/07/2010 144024990168 144024990168
1 Service brake: efficiency below requirements (3.7.b.7) Service brake: efficiency below requirements (3.7.b.7) 13 July 2010 [13:09] 13/07/2010 144024990168 144024990168
1 Brakes imbalanced across an axle (3.7.b.5b) Brakes imbalanced across an axle (3.7.b.5b) 13 July 2010 [13:09] 13/07/2010 144024990168 144024990168

ALL 274 CVB User Entered Faults [1]

ALL User Entered faults, ORDERED by OCCURRENCE DURING 274 CVB's MOT HISTORY
ALL 274 CVB User Entered Faults [1]
ALL User Entered faults, ORDERED by OCCURRENCE DURING 274 CVB's MOT HISTORY
Advisory Faults | source www.vehiclestats.co.uk
Fault Fault Test Date Test Date/Time Reference MOT Test Reference
1 Hazard light,s in-op Hazard light,s in-op 09 April 2009 [10:05] 09/04/2009 711739499004 711739499004

MOT TEST: 05 January 2019 09:21:57 PASSED
MOT TEST: 05 January 2019 09:21:57 PASSED

This test (683680786833) was completed on the 05 January 2019 09:21:57 and PASSED the requirements for a valid MOT with 1 comments.

This test (683680786833) was completed on the 05 January 2019 09:21:57 and PASSED the requirements for a valid MOT with 1 comments.

Recorded mileage: 30,616

Recorded mileage: 30,616


ADVISORY


MOT TEST: 03 September 2018 16:25:17 FAILED
MOT TEST: 03 September 2018 16:25:17 FAILED

This test (294865907435) was completed on the 03 September 2018 16:25:17 and FAILED the requirements for a valid MOT with 6 comments.

This test (294865907435) was completed on the 03 September 2018 16:25:17 and FAILED the requirements for a valid MOT with 6 comments.

Recorded mileage: 30,616

Recorded mileage: 30,616


ADVISORY

FAIL


MOT TEST: 20 June 2017 14:38:43 PASSED
MOT TEST: 20 June 2017 14:38:43 PASSED

This test (533828594175) was completed on the 20 June 2017 14:38:43 and PASSED the requirements for a valid MOT with 0 comments.

This test (533828594175) was completed on the 20 June 2017 14:38:43 and PASSED the requirements for a valid MOT with 0 comments.

Recorded mileage: 30,621

Recorded mileage: 30,621


MOT TEST: 12 June 2017 09:05:41 FAILED
MOT TEST: 12 June 2017 09:05:41 FAILED

This test (989487518791) was completed on the 12 June 2017 09:05:41 and FAILED the requirements for a valid MOT with 8 comments.

This test (989487518791) was completed on the 12 June 2017 09:05:41 and FAILED the requirements for a valid MOT with 8 comments.

Recorded mileage: 30,616

Recorded mileage: 30,616


ADVISORY

FAIL


MOT TEST: 23 July 2010 13:49:20 PASSED
MOT TEST: 23 July 2010 13:49:20 PASSED

This test (382154600487) was completed on the 23 July 2010 13:49:20 and PASSED the requirements for a valid MOT with 0 comments.

This test (382154600487) was completed on the 23 July 2010 13:49:20 and PASSED the requirements for a valid MOT with 0 comments.

Recorded mileage: 30,594

Recorded mileage: 30,594


MOT TEST: 13 July 2010 13:09:23 FAILED
MOT TEST: 13 July 2010 13:09:23 FAILED

This test (144024990168) was completed on the 13 July 2010 13:09:23 and FAILED the requirements for a valid MOT with 6 comments.

This test (144024990168) was completed on the 13 July 2010 13:09:23 and FAILED the requirements for a valid MOT with 6 comments.

Recorded mileage: 30,594

Recorded mileage: 30,594


FAIL


MOT TEST: 09 April 2009 10:05:26 PASSED
MOT TEST: 09 April 2009 10:05:26 PASSED

This test (711739499004) was completed on the 09 April 2009 10:05:26 and PASSED the requirements for a valid MOT with 2 comments.

This test (711739499004) was completed on the 09 April 2009 10:05:26 and PASSED the requirements for a valid MOT with 2 comments.

Recorded mileage: 30,169

Recorded mileage: 30,169


ADVISORY

USER ENTERED


MOT TEST: 06 October 2007 08:44:16 PASSED
MOT TEST: 06 October 2007 08:44:16 PASSED

This test (102039377226) was completed on the 06 October 2007 08:44:16 and PASSED the requirements for a valid MOT with 0 comments.

This test (102039377226) was completed on the 06 October 2007 08:44:16 and PASSED the requirements for a valid MOT with 0 comments.

Recorded mileage: 30,009

Recorded mileage: 30,009


MOT TEST: 13 October 2006 09:35:47 PASSED
MOT TEST: 13 October 2006 09:35:47 PASSED

This test (162266886218) was completed on the 13 October 2006 09:35:47 and PASSED the requirements for a valid MOT with 0 comments.

This test (162266886218) was completed on the 13 October 2006 09:35:47 and PASSED the requirements for a valid MOT with 0 comments.

Recorded mileage: 30,009

Recorded mileage: 30,009