282 UXW


282UXW is registered to a Black 1960, Morris Minor 1000 with a Petrol engine. It Failed its most recent MOT Test on the 09 March 2007

3 unique faults (3 Total) reported in its MOT History (3 Tests).

0 common/recurring faults.

67% (2) MOT Pass Rate and a 33% (1) MOT Failure Rate.

70,729 recorded miles.

282 UXW


282UXW is registered to a Black 1960, Morris Minor 1000 with a Petrol engine. It Failed its most recent MOT Test on the 09 March 2007

3 unique faults (3 Total) reported in its MOT History (3 Tests).

0 common/recurring faults.

67% (2) MOT Pass Rate and a 33% (1) MOT Failure Rate.

70,729 recorded miles.

MOT PASS/Failure rate for 282 UXW

all MOT test results for 282 UXW represented as a percentage
MOT PASS/Failure rate for 282 UXW
all MOT test results for 282 UXW represented as a percentage

PERCENTAGE OF VEHICLE FAULTS WITH 282 UXW

ALL REPORTED FAULTS, DISPLAYED BY PERCENTAGE OF OCCURRENCE DURING ALL MOT TESTS
PERCENTAGE OF VEHICLE FAULTS WITH 282 UXW
ALL REPORTED FAULTS, DISPLAYED BY PERCENTAGE OF OCCURRENCE DURING ALL MOT TESTS
FAIL

282 UXW annual Faults by type

ALL REPORTED FAULTS, DISPLAYED over time and categorised by type
282 UXW annual Faults by type
ALL REPORTED FAULTS, DISPLAYED over time and categorised by type

ALL 282 UXW Failure Faults [3]

ALL Failure faults, ORDERED by OCCURRENCE DURING 282 UXW's MOT HISTORY
ALL 282 UXW Failure Faults [3]
ALL Failure faults, ORDERED by OCCURRENCE DURING 282 UXW's MOT HISTORY
Fail Faults | source www.vehiclestats.co.uk
Fault Fault Test Date Test Date/Time Reference MOT Test Reference
1 Nearside rear parking brake recording little or no effort (3.7.b.6a) Nearside rear parking brake recording little or no effort (3.7.b.6a) 01 March 2007 [11:13] 01/03/2007 120460167098 120460167098
1 Nearside rear brake recording little or no effort (3.7.b.5a) Nearside rear brake recording little or no effort (3.7.b.5a) 01 March 2007 [11:13] 01/03/2007 120460167098 120460167098
1 Parking brake: efficiency below requirements (3.7.b.7) Parking brake: efficiency below requirements (3.7.b.7) 01 March 2007 [11:13] 01/03/2007 120460167098 120460167098

MOT TEST: 09 March 2007 13:46:07 PASSED
MOT TEST: 09 March 2007 13:46:07 PASSED

This test (173898767488) was completed on the 09 March 2007 13:46:07 and PASSED the requirements for a valid MOT with 0 comments.

This test (173898767488) was completed on the 09 March 2007 13:46:07 and PASSED the requirements for a valid MOT with 0 comments.

Recorded mileage: 70,729

Recorded mileage: 70,729


MOT TEST: 01 March 2007 11:13:22 FAILED
MOT TEST: 01 March 2007 11:13:22 FAILED

This test (120460167098) was completed on the 01 March 2007 11:13:22 and FAILED the requirements for a valid MOT with 3 comments.

This test (120460167098) was completed on the 01 March 2007 11:13:22 and FAILED the requirements for a valid MOT with 3 comments.

Recorded mileage: 70,729

Recorded mileage: 70,729


FAIL


MOT TEST: 22 October 2005 11:45:56 PASSED
MOT TEST: 22 October 2005 11:45:56 PASSED

This test (380855895274) was completed on the 22 October 2005 11:45:56 and PASSED the requirements for a valid MOT with 0 comments.

This test (380855895274) was completed on the 22 October 2005 11:45:56 and PASSED the requirements for a valid MOT with 0 comments.

Recorded mileage: 70,729

Recorded mileage: 70,729