288 6NT


2886NT is registered to a Grey 1984, Morris Minor with a Petrol engine. It Passed its most recent MOT Test on the 06 December 2018

6 unique faults (7 Total) reported in its MOT History (6 Tests).

1 common/recurring faults.

50% (3) MOT Pass Rate and a 50% (3) MOT Failure Rate.

6,432 recorded miles.

288 6NT


2886NT is registered to a Grey 1984, Morris Minor with a Petrol engine. It Passed its most recent MOT Test on the 06 December 2018

6 unique faults (7 Total) reported in its MOT History (6 Tests).

1 common/recurring faults.

50% (3) MOT Pass Rate and a 50% (3) MOT Failure Rate.

6,432 recorded miles.

MOT PASS/Failure rate for 288 6NT

all MOT test results for 288 6NT represented as a percentage
MOT PASS/Failure rate for 288 6NT
all MOT test results for 288 6NT represented as a percentage

PERCENTAGE OF VEHICLE FAULTS WITH 288 6NT

ALL REPORTED FAULTS, DISPLAYED BY PERCENTAGE OF OCCURRENCE DURING ALL MOT TESTS
PERCENTAGE OF VEHICLE FAULTS WITH 288 6NT
ALL REPORTED FAULTS, DISPLAYED BY PERCENTAGE OF OCCURRENCE DURING ALL MOT TESTS
ADVISORY

FAIL

PASS WITH RECTIFICATION

288 6NT annual Faults by type

ALL REPORTED FAULTS, DISPLAYED over time and categorised by type
288 6NT annual Faults by type
ALL REPORTED FAULTS, DISPLAYED over time and categorised by type

ALL 288 6NT ADVISORIES [2]

ALL ADVISORIES, ORDERED by OCCURRENCE DURING 288 6NT's MOT HISTORY
ALL 288 6NT ADVISORIES [2]
ALL ADVISORIES, ORDERED by OCCURRENCE DURING 288 6NT's MOT HISTORY
Advisory Faults | source www.vehiclestats.co.uk
Fault Fault Test Date Test Date/Time Reference MOT Test Reference
2 Nearside rear age cracking to tyre Nearside rear age cracking to tyre 06 December 2018 [14:44] 06/12/2018 06 December 2018 [10:21] 06/12/2018 813479876971 813479876971 568340088398 568340088398

ALL 288 6NT Failure Faults [3]

ALL Failure faults, ORDERED by OCCURRENCE DURING 288 6NT's MOT HISTORY
ALL 288 6NT Failure Faults [3]
ALL Failure faults, ORDERED by OCCURRENCE DURING 288 6NT's MOT HISTORY
Fail Faults | source www.vehiclestats.co.uk
Fault Fault Test Date Test Date/Time Reference MOT Test Reference
1 Nearside headlamp not working on main beam (4.1.1 (a) (ii)) Nearside headlamp not working on main beam (4.1.1 (a) (ii)) 06 December 2018 [10:21] 06/12/2018 568340088398 568340088398
1 Nearside rear seat belt insecurely fixed to the vehicles structure (5.2.1a) Nearside rear seat belt insecurely fixed to the vehicles structure (5.2.1a) 24 March 2017 [15:33] 24/03/2017 326311557122 326311557122
1 Offside rear seat belt insecurely fixed to the vehicles structure (5.2.1a) Offside rear seat belt insecurely fixed to the vehicles structure (5.2.1a) 24 March 2017 [15:33] 24/03/2017 326311557122 326311557122

ALL 288 6NT Pass With Rectification Faults [2]

ALL Pass With Rectification faults, ORDERED by OCCURRENCE DURING 288 6NT's MOT HISTORY
ALL 288 6NT Pass With Rectification Faults [2]
ALL Pass With Rectification faults, ORDERED by OCCURRENCE DURING 288 6NT's MOT HISTORY
Pass With Rectification Faults | source www.vehiclestats.co.uk
Fault Fault Test Date Test Date/Time Reference MOT Test Reference
1 Nearside windscreen wiper blade deteriorated (8.2.2) Nearside windscreen wiper blade deteriorated (8.2.2) 27 July 2005 [13:36] 27/07/2005 921538305286 921538305286
1 Offside windscreen wiper blade deteriorated (8.2.2) Offside windscreen wiper blade deteriorated (8.2.2) 27 July 2005 [13:36] 27/07/2005 921538305286 921538305286

MOT TEST: 06 December 2018 14:44:39 PASSED
MOT TEST: 06 December 2018 14:44:39 PASSED

This test (813479876971) was completed on the 06 December 2018 14:44:39 and PASSED the requirements for a valid MOT with 1 comments.

This test (813479876971) was completed on the 06 December 2018 14:44:39 and PASSED the requirements for a valid MOT with 1 comments.

Recorded mileage: 6,432

Recorded mileage: 6,432


ADVISORY


MOT TEST: 06 December 2018 10:21:26 FAILED
MOT TEST: 06 December 2018 10:21:26 FAILED

This test (568340088398) was completed on the 06 December 2018 10:21:26 and FAILED the requirements for a valid MOT with 2 comments.

This test (568340088398) was completed on the 06 December 2018 10:21:26 and FAILED the requirements for a valid MOT with 2 comments.

Recorded mileage: 6,432

Recorded mileage: 6,432


ADVISORY

FAIL


MOT TEST: 24 March 2017 16:40:40 PASSED
MOT TEST: 24 March 2017 16:40:40 PASSED

This test (563474860502) was completed on the 24 March 2017 16:40:40 and PASSED the requirements for a valid MOT with 0 comments.

This test (563474860502) was completed on the 24 March 2017 16:40:40 and PASSED the requirements for a valid MOT with 0 comments.

Recorded mileage: 6,316

Recorded mileage: 6,316


MOT TEST: 24 March 2017 15:33:14 FAILED
MOT TEST: 24 March 2017 15:33:14 FAILED

This test (326311557122) was completed on the 24 March 2017 15:33:14 and FAILED the requirements for a valid MOT with 2 comments.

This test (326311557122) was completed on the 24 March 2017 15:33:14 and FAILED the requirements for a valid MOT with 2 comments.

Recorded mileage: 6,316

Recorded mileage: 6,316


FAIL


MOT TEST: 27 July 2005 13:36:53 PASSED
MOT TEST: 27 July 2005 13:36:53 PASSED

This test (743578405289) was completed on the 27 July 2005 13:36:53 and PASSED the requirements for a valid MOT with 0 comments.

This test (743578405289) was completed on the 27 July 2005 13:36:53 and PASSED the requirements for a valid MOT with 0 comments.

Recorded mileage: 6,311

Recorded mileage: 6,311


MOT TEST: 27 July 2005 13:36:53 FAILED
MOT TEST: 27 July 2005 13:36:53 FAILED

This test (921538305286) was completed on the 27 July 2005 13:36:53 and FAILED the requirements for a valid MOT with 2 comments.

This test (921538305286) was completed on the 27 July 2005 13:36:53 and FAILED the requirements for a valid MOT with 2 comments.

Recorded mileage: 6,311

Recorded mileage: 6,311


PASS WITH RECTIFICATION