30KHT


30KHT is registered to a Blue 1960, Morris Minor with a Petrol engine. It Passed its most recent MOT Test on the 08 August 2018

32 unique faults (39 Total) reported in its MOT History (14 Tests).

7 common/recurring faults, the most frequent (2 times) is: Nearside Rear Brake pipe slightly corroded (3.6.B.2c).

64% (9) MOT Pass Rate and a 36% (5) MOT Failure Rate.

3,627 recorded miles.

30KHT


30KHT is registered to a Blue 1960, Morris Minor with a Petrol engine. It Passed its most recent MOT Test on the 08 August 2018

32 unique faults (39 Total) reported in its MOT History (14 Tests).

7 common/recurring faults, the most frequent (2 times) is: Nearside Rear Brake pipe slightly corroded (3.6.B.2c).

64% (9) MOT Pass Rate and a 36% (5) MOT Failure Rate.

3,627 recorded miles.

MOT PASS/Failure rate for 30KHT

all MOT test results for 30KHT represented as a percentage
MOT PASS/Failure rate for 30KHT
all MOT test results for 30KHT represented as a percentage

PERCENTAGE OF VEHICLE FAULTS WITH 30KHT

ALL REPORTED FAULTS, DISPLAYED BY PERCENTAGE OF OCCURRENCE DURING ALL MOT TESTS
PERCENTAGE OF VEHICLE FAULTS WITH 30KHT
ALL REPORTED FAULTS, DISPLAYED BY PERCENTAGE OF OCCURRENCE DURING ALL MOT TESTS
ADVISORY

FAIL

USER ENTERED

PASS WITH RECTIFICATION

30KHT annual Faults by type

ALL REPORTED FAULTS, DISPLAYED over time and categorised by type
30KHT annual Faults by type
ALL REPORTED FAULTS, DISPLAYED over time and categorised by type

RECURRING FAULTS WITH 30KHT

FAULTS THAT HAVE OCCURED MORE THAN ONCE DURING 30KHT's MOT HISTORY
RECURRING FAULTS WITH 30KHT
FAULTS THAT HAVE OCCURED MORE THAN ONCE DURING 30KHT's MOT HISTORY
Fault Fault Test Date Test Date/Time Reference MOT Test Reference
2 Nearside rear brake pipe slightly corroded (3.6.b.2c) Nearside rear brake pipe slightly corroded (3.6.b.2c) 01 May 2014 [08:11] 01/05/2014 28 April 2014 [08:50] 28/04/2014 486931724165 486931724165 749588314173 749588314173
2 Offside rear brake pipe slightly corroded (3.6.b.2c) Offside rear brake pipe slightly corroded (3.6.b.2c) 01 May 2014 [08:11] 01/05/2014 28 April 2014 [08:50] 28/04/2014 486931724165 486931724165 749588314173 749588314173
2 Offside front wheel bearing has slight play (2.5.a.3c) Offside front wheel bearing has slight play (2.5.a.3c) 06 October 2008 [13:01] 06/10/2008 06 October 2008 [13:01] 06/10/2008 443930588264 443930588264 381380488438 381380488438
2 Nearside front brake juddering slightly (3.7.a.2b) Nearside front brake juddering slightly (3.7.a.2b) 06 October 2008 [13:01] 06/10/2008 06 October 2008 [13:01] 06/10/2008 443930588264 443930588264 381380488438 381380488438
2 Offside front brake juddering slightly (3.7.a.2b) Offside front brake juddering slightly (3.7.a.2b) 06 October 2008 [13:01] 06/10/2008 06 October 2008 [13:01] 06/10/2008 443930588264 443930588264 381380488438 381380488438
2 O/s front and both rear brakes slightly binding O/s front and both rear brakes slightly binding 06 October 2008 [13:01] 06/10/2008 06 October 2008 [13:01] 06/10/2008 443930588264 443930588264 381380488438 381380488438
2 N/s rear chassis leg N/s rear chassis leg 06 October 2008 [13:01] 06/10/2008 06 October 2008 [13:01] 06/10/2008 443930588264 443930588264 381380488438 381380488438

ALL 30KHT ADVISORIES [13]

ALL ADVISORIES, ORDERED by OCCURRENCE DURING 30KHT's MOT HISTORY
ALL 30KHT ADVISORIES [13]
ALL ADVISORIES, ORDERED by OCCURRENCE DURING 30KHT's MOT HISTORY
Advisory Faults | source www.vehiclestats.co.uk
Fault Fault Test Date Test Date/Time Reference MOT Test Reference
2 Nearside rear brake pipe slightly corroded (3.6.b.2c) Nearside rear brake pipe slightly corroded (3.6.b.2c) 01 May 2014 [08:11] 01/05/2014 28 April 2014 [08:50] 28/04/2014 486931724165 486931724165 749588314173 749588314173
2 Offside rear brake pipe slightly corroded (3.6.b.2c) Offside rear brake pipe slightly corroded (3.6.b.2c) 01 May 2014 [08:11] 01/05/2014 28 April 2014 [08:50] 28/04/2014 486931724165 486931724165 749588314173 749588314173
2 Offside front wheel bearing has slight play (2.5.a.3c) Offside front wheel bearing has slight play (2.5.a.3c) 06 October 2008 [13:01] 06/10/2008 06 October 2008 [13:01] 06/10/2008 443930588264 443930588264 381380488438 381380488438
2 Nearside front brake juddering slightly (3.7.a.2b) Nearside front brake juddering slightly (3.7.a.2b) 06 October 2008 [13:01] 06/10/2008 06 October 2008 [13:01] 06/10/2008 443930588264 443930588264 381380488438 381380488438
2 Offside front brake juddering slightly (3.7.a.2b) Offside front brake juddering slightly (3.7.a.2b) 06 October 2008 [13:01] 06/10/2008 06 October 2008 [13:01] 06/10/2008 443930588264 443930588264 381380488438 381380488438
1 Nearside front shock absorber has a light misting of oil (2.7.3) Nearside front shock absorber has a light misting of oil (2.7.3) 28 April 2014 [08:50] 28/04/2014 749588314173 749588314173
1 Offside front shock absorber has a light misting of oil (2.7.3) Offside front shock absorber has a light misting of oil (2.7.3) 28 April 2014 [08:50] 28/04/2014 749588314173 749588314173
1 Nearside rear suspension spring mounting prescribed area is corroded but not considered excessive (2.4.a.3) Nearside rear suspension spring mounting prescribed area is corroded but not considered excessive (2.4.a.3) 05 September 2007 [13:57] 05/09/2007 954248447294 954248447294

ALL 30KHT Failure Faults [14]

ALL Failure faults, ORDERED by OCCURRENCE DURING 30KHT's MOT HISTORY
ALL 30KHT Failure Faults [14]
ALL Failure faults, ORDERED by OCCURRENCE DURING 30KHT's MOT HISTORY
Fail Faults | source www.vehiclestats.co.uk
Fault Fault Test Date Test Date/Time Reference MOT Test Reference
1 Offside front upper front suspension has excessive movement at wishbone bearing (2.5.a.1c) Offside front upper front suspension has excessive movement at wishbone bearing (2.5.a.1c) 10 May 2018 [12:04] 10/05/2018 545265116122 545265116122
1 Offside front suspension arm has excessive play in a pin/bearing pin loose in housing (2.4.g.2) Offside front suspension arm has excessive play in a pin/bearing pin loose in housing (2.4.g.2) 10 May 2018 [12:04] 10/05/2018 545265116122 545265116122
1 Nearside front front suspension locking device ineffective (2.5.a.4) Nearside front front suspension locking device ineffective (2.5.a.4) 28 April 2014 [08:50] 28/04/2014 749588314173 749588314173
1 Offside front front suspension locking device ineffective (2.5.a.4) Offside front front suspension locking device ineffective (2.5.a.4) 28 April 2014 [08:50] 28/04/2014 749588314173 749588314173
1 Exhaust has a major leak of exhaust gases (7.1.2) Exhaust has a major leak of exhaust gases (7.1.2) 28 April 2014 [08:50] 28/04/2014 749588314173 749588314173
1 Nearside steering rack gaiter split (2.2.d.2d) Nearside steering rack gaiter split (2.2.d.2d) 28 April 2014 [08:50] 28/04/2014 749588314173 749588314173
1 Offside front front suspension has excessive play in a lower suspension ball joint (2.5.b.1a) Offside front front suspension has excessive play in a lower suspension ball joint (2.5.b.1a) 28 April 2014 [08:50] 28/04/2014 749588314173 749588314173
1 Nearside front suspension has excessive play in a lower suspension ball joint (2.5.b.1a) Nearside front suspension has excessive play in a lower suspension ball joint (2.5.b.1a) 28 April 2014 [08:50] 28/04/2014 749588314173 749588314173
1 Nearside front front brake binding (3.7.b.1) Nearside front front brake binding (3.7.b.1) 28 April 2014 [08:50] 28/04/2014 749588314173 749588314173
1 Offside front front brake binding (3.7.b.1) Offside front front brake binding (3.7.b.1) 28 April 2014 [08:50] 28/04/2014 749588314173 749588314173
1 Nearside rear parking brake recording little or no effort (3.7.b.6a) Nearside rear parking brake recording little or no effort (3.7.b.6a) 28 April 2014 [08:50] 28/04/2014 749588314173 749588314173
1 Offside rear parking brake recording little or no effort (3.7.b.6a) Offside rear parking brake recording little or no effort (3.7.b.6a) 28 April 2014 [08:50] 28/04/2014 749588314173 749588314173
1 Parking brake: efficiency below requirements (3.7.b.7) Parking brake: efficiency below requirements (3.7.b.7) 28 April 2014 [08:50] 28/04/2014 749588314173 749588314173
1 Offside suspension component mounting prescribed area is excessively corroded (2.4.a.3) Offside suspension component mounting prescribed area is excessively corroded (2.4.a.3) 05 September 2007 [13:57] 05/09/2007 954248447294 954248447294

ALL 30KHT User Entered Faults [8]

ALL User Entered faults, ORDERED by OCCURRENCE DURING 30KHT's MOT HISTORY
ALL 30KHT User Entered Faults [8]
ALL User Entered faults, ORDERED by OCCURRENCE DURING 30KHT's MOT HISTORY
Advisory Faults | source www.vehiclestats.co.uk
Fault Fault Test Date Test Date/Time Reference MOT Test Reference
2 O/s front and both rear brakes slightly binding O/s front and both rear brakes slightly binding 06 October 2008 [13:01] 06/10/2008 06 October 2008 [13:01] 06/10/2008 443930588264 443930588264 381380488438 381380488438
2 N/s rear chassis leg N/s rear chassis leg 06 October 2008 [13:01] 06/10/2008 06 October 2008 [13:01] 06/10/2008 443930588264 443930588264 381380488438 381380488438
1 Slight freeplay brakepedal/clutch pedal cross shaft Slight freeplay brakepedal/clutch pedal cross shaft 28 April 2014 [08:50] 28/04/2014 749588314173 749588314173
1 Slight noise both front wheel bearings Slight noise both front wheel bearings 05 September 2007 [13:57] 05/09/2007 954248447294 954248447294
1 Both front floors/ unable to see full repair on o/s rearleaf sring mount Both front floors/ unable to see full repair on o/s rearleaf sring mount 05 September 2007 [13:57] 05/09/2007 954248447294 954248447294
1 N/s rear wheel very slightly binding N/s rear wheel very slightly binding 05 September 2007 [13:57] 05/09/2007 954248447294 954248447294

ALL 30KHT Pass With Rectification Faults [4]

ALL Pass With Rectification faults, ORDERED by OCCURRENCE DURING 30KHT's MOT HISTORY
ALL 30KHT Pass With Rectification Faults [4]
ALL Pass With Rectification faults, ORDERED by OCCURRENCE DURING 30KHT's MOT HISTORY
Pass With Rectification Faults | source www.vehiclestats.co.uk
Fault Fault Test Date Test Date/Time Reference MOT Test Reference
1 Nearside front upper suspension arm has excessive play in a pin/bush (2.4.g.2) Nearside front upper suspension arm has excessive play in a pin/bush (2.4.g.2) 10 May 2017 [10:39] 10/05/2017 189541721655 189541721655
1 Offside headlamp aim too high (1.8) Offside headlamp aim too high (1.8) 28 April 2014 [08:50] 28/04/2014 749588314173 749588314173
1 Rear registration plate lamp not working (1.1.5c) Rear registration plate lamp not working (1.1.5c) 06 October 2008 [13:01] 06/10/2008 381380488438 381380488438
1 Nearside headlamp not in good working order (not working) (1.2.4a) Nearside headlamp not in good working order (not working) (1.2.4a) 06 October 2008 [13:01] 06/10/2008 381380488438 381380488438

MOT TEST: 08 August 2018 14:25:50 PASSED
MOT TEST: 08 August 2018 14:25:50 PASSED

This test (646339616075) was completed on the 08 August 2018 14:25:50 and PASSED the requirements for a valid MOT with 0 comments.

This test (646339616075) was completed on the 08 August 2018 14:25:50 and PASSED the requirements for a valid MOT with 0 comments.

Recorded mileage: 3,627

Recorded mileage: 3,627


MOT TEST: 10 May 2018 13:51:20 PASSED
MOT TEST: 10 May 2018 13:51:20 PASSED

This test (254556339329) was completed on the 10 May 2018 13:51:20 and PASSED the requirements for a valid MOT with 0 comments.

This test (254556339329) was completed on the 10 May 2018 13:51:20 and PASSED the requirements for a valid MOT with 0 comments.

Recorded mileage: 3,571

Recorded mileage: 3,571


MOT TEST: 10 May 2018 12:04:31 FAILED
MOT TEST: 10 May 2018 12:04:31 FAILED

This test (545265116122) was completed on the 10 May 2018 12:04:31 and FAILED the requirements for a valid MOT with 2 comments.

This test (545265116122) was completed on the 10 May 2018 12:04:31 and FAILED the requirements for a valid MOT with 2 comments.

Recorded mileage: 3,571

Recorded mileage: 3,571


FAIL


MOT TEST: 10 May 2017 10:39:11 PASSED
MOT TEST: 10 May 2017 10:39:11 PASSED

This test (675395946378) was completed on the 10 May 2017 10:39:11 and PASSED the requirements for a valid MOT with 0 comments.

This test (675395946378) was completed on the 10 May 2017 10:39:11 and PASSED the requirements for a valid MOT with 0 comments.

Recorded mileage: 2,547

Recorded mileage: 2,547


MOT TEST: 10 May 2017 10:39:10 FAILED
MOT TEST: 10 May 2017 10:39:10 FAILED

This test (189541721655) was completed on the 10 May 2017 10:39:10 and FAILED the requirements for a valid MOT with 1 comments.

This test (189541721655) was completed on the 10 May 2017 10:39:10 and FAILED the requirements for a valid MOT with 1 comments.

Recorded mileage: 2,547

Recorded mileage: 2,547


PASS WITH RECTIFICATION


MOT TEST: 01 May 2014 08:11:49 PASSED
MOT TEST: 01 May 2014 08:11:49 PASSED

This test (486931724165) was completed on the 01 May 2014 08:11:49 and PASSED the requirements for a valid MOT with 2 comments.

This test (486931724165) was completed on the 01 May 2014 08:11:49 and PASSED the requirements for a valid MOT with 2 comments.

Recorded mileage: 2,125

Recorded mileage: 2,125


ADVISORY


MOT TEST: 28 April 2014 08:50:58 FAILED
MOT TEST: 28 April 2014 08:50:58 FAILED

This test (749588314173) was completed on the 28 April 2014 08:50:58 and FAILED the requirements for a valid MOT with 17 comments.

This test (749588314173) was completed on the 28 April 2014 08:50:58 and FAILED the requirements for a valid MOT with 17 comments.

Recorded mileage: 2,116

Recorded mileage: 2,116


ADVISORY

FAIL

USER ENTERED

PASS WITH RECTIFICATION


MOT TEST: 17 July 2012 14:32:32 PASSED
MOT TEST: 17 July 2012 14:32:32 PASSED

This test (306189992151) was completed on the 17 July 2012 14:32:32 and PASSED the requirements for a valid MOT with 0 comments.

This test (306189992151) was completed on the 17 July 2012 14:32:32 and PASSED the requirements for a valid MOT with 0 comments.

Recorded mileage: 819

Recorded mileage: 819


MOT TEST: 21 February 2010 12:30:42 PASSED
MOT TEST: 21 February 2010 12:30:42 PASSED

This test (203002950049) was completed on the 21 February 2010 12:30:42 and PASSED the requirements for a valid MOT with 0 comments.

This test (203002950049) was completed on the 21 February 2010 12:30:42 and PASSED the requirements for a valid MOT with 0 comments.

Recorded mileage: 491

Recorded mileage: 491


MOT TEST: 02 March 2009 12:44:55 PASSED
MOT TEST: 02 March 2009 12:44:55 PASSED

This test (921631269061) was completed on the 02 March 2009 12:44:55 and PASSED the requirements for a valid MOT with 0 comments.

This test (921631269061) was completed on the 02 March 2009 12:44:55 and PASSED the requirements for a valid MOT with 0 comments.

Recorded mileage: 369

Recorded mileage: 369


MOT TEST: 06 October 2008 13:01:42 PASSED
MOT TEST: 06 October 2008 13:01:42 PASSED

This test (443930588264) was completed on the 06 October 2008 13:01:42 and PASSED the requirements for a valid MOT with 5 comments.

This test (443930588264) was completed on the 06 October 2008 13:01:42 and PASSED the requirements for a valid MOT with 5 comments.

Recorded mileage: 288

Recorded mileage: 288


ADVISORY

USER ENTERED


MOT TEST: 06 October 2008 13:01:42 FAILED
MOT TEST: 06 October 2008 13:01:42 FAILED

This test (381380488438) was completed on the 06 October 2008 13:01:42 and FAILED the requirements for a valid MOT with 7 comments.

This test (381380488438) was completed on the 06 October 2008 13:01:42 and FAILED the requirements for a valid MOT with 7 comments.

Recorded mileage: 288

Recorded mileage: 288


ADVISORY

USER ENTERED

PASS WITH RECTIFICATION


MOT TEST: 10 September 2007 14:36:08 PASSED
MOT TEST: 10 September 2007 14:36:08 PASSED

This test (334663457447) was completed on the 10 September 2007 14:36:08 and PASSED the requirements for a valid MOT with 0 comments.

This test (334663457447) was completed on the 10 September 2007 14:36:08 and PASSED the requirements for a valid MOT with 0 comments.

Recorded mileage: 144

Recorded mileage: 144


MOT TEST: 05 September 2007 13:57:53 FAILED
MOT TEST: 05 September 2007 13:57:53 FAILED

This test (954248447294) was completed on the 05 September 2007 13:57:53 and FAILED the requirements for a valid MOT with 5 comments.

This test (954248447294) was completed on the 05 September 2007 13:57:53 and FAILED the requirements for a valid MOT with 5 comments.

Recorded mileage: 143

Recorded mileage: 143


ADVISORY

FAIL

USER ENTERED