312 BWV


312BWV is registered to a Green 1963, Morris Minor traveller with a Petrol engine. It Passed its most recent MOT Test on the 05 June 2018

19 unique faults (19 Total) reported in its MOT History (15 Tests).

0 common/recurring faults.

73% (11) MOT Pass Rate and a 27% (4) MOT Failure Rate.

26,343 recorded miles.

312 BWV


312BWV is registered to a Green 1963, Morris Minor traveller with a Petrol engine. It Passed its most recent MOT Test on the 05 June 2018

19 unique faults (19 Total) reported in its MOT History (15 Tests).

0 common/recurring faults.

73% (11) MOT Pass Rate and a 27% (4) MOT Failure Rate.

26,343 recorded miles.

MOT PASS/Failure rate for 312 BWV

all MOT test results for 312 BWV represented as a percentage
MOT PASS/Failure rate for 312 BWV
all MOT test results for 312 BWV represented as a percentage

PERCENTAGE OF VEHICLE FAULTS WITH 312 BWV

ALL REPORTED FAULTS, DISPLAYED BY PERCENTAGE OF OCCURRENCE DURING ALL MOT TESTS
PERCENTAGE OF VEHICLE FAULTS WITH 312 BWV
ALL REPORTED FAULTS, DISPLAYED BY PERCENTAGE OF OCCURRENCE DURING ALL MOT TESTS
ADVISORY

FAIL

USER ENTERED

312 BWV annual Faults by type

ALL REPORTED FAULTS, DISPLAYED over time and categorised by type
312 BWV annual Faults by type
ALL REPORTED FAULTS, DISPLAYED over time and categorised by type

ALL 312 BWV ADVISORIES [6]

ALL ADVISORIES, ORDERED by OCCURRENCE DURING 312 BWV's MOT HISTORY
ALL 312 BWV ADVISORIES [6]
ALL ADVISORIES, ORDERED by OCCURRENCE DURING 312 BWV's MOT HISTORY
Advisory Faults | source www.vehiclestats.co.uk
Fault Fault Test Date Test Date/Time Reference MOT Test Reference
1 Lower suspension arm has slight play in a pin/bearing (2.4.g.2) Lower suspension arm has slight play in a pin/bearing (2.4.g.2) 24 September 2013 [16:07] 24/09/2013 336157263479 336157263479
1 Nearside front lower suspension arm has slight play in a pin/bearing (2.4.g.2) Nearside front lower suspension arm has slight play in a pin/bearing (2.4.g.2) 24 September 2013 [16:07] 24/09/2013 336157263479 336157263479
1 Centre exhaust has part of the system slightly deteriorated (7.1.1a) Centre exhaust has part of the system slightly deteriorated (7.1.1a) 19 September 2011 [13:46] 19/09/2011 655382861208 655382861208
1 Offside front lower suspension arm has slight play in a pin/bush (2.4.g.2) Offside front lower suspension arm has slight play in a pin/bush (2.4.g.2) 19 September 2011 [13:46] 19/09/2011 655382861208 655382861208
1 Nearside front lower suspension arm has slight play in a pin/bush (2.4.g.2) Nearside front lower suspension arm has slight play in a pin/bush (2.4.g.2) 31 August 2010 [12:38] 31/08/2010 841393840286 841393840286
1 Offside front upper suspension arm rubber bush deteriorated but not resulting in excessive movement (2.4.g.2) Offside front upper suspension arm rubber bush deteriorated but not resulting in excessive movement (2.4.g.2) 31 August 2010 [12:38] 31/08/2010 841393840286 841393840286

ALL 312 BWV Failure Faults [11]

ALL Failure faults, ORDERED by OCCURRENCE DURING 312 BWV's MOT HISTORY
ALL 312 BWV Failure Faults [11]
ALL Failure faults, ORDERED by OCCURRENCE DURING 312 BWV's MOT HISTORY
Fail Faults | source www.vehiclestats.co.uk
Fault Fault Test Date Test Date/Time Reference MOT Test Reference
1 Rear brakes imbalanced across an axle axle 2 (3.7.b.5b) Rear brakes imbalanced across an axle axle 2 (3.7.b.5b) 01 August 2016 [11:29] 01/08/2016 525755911462 525755911462
1 Offside rear brake binding (3.7.b.1) Offside rear brake binding (3.7.b.1) 01 August 2016 [11:29] 01/08/2016 525755911462 525755911462
1 Rear brake application uneven (3.7.b.2) Rear brake application uneven (3.7.b.2) 19 September 2012 [11:47] 19/09/2012 119973962229 119973962229
1 Offside front front brake binding (3.7.b.1) Offside front front brake binding (3.7.b.1) 19 September 2012 [11:47] 19/09/2012 119973962229 119973962229
1 Nearside steering rack gaiter split (2.2.d.2d) Nearside steering rack gaiter split (2.2.d.2d) 02 September 2011 [09:54] 02/09/2011 568645541215 568645541215
1 Braking system leaking (3.6.a.1) Braking system leaking (3.6.a.1) 02 September 2011 [09:54] 02/09/2011 568645541215 568645541215
1 Offside headlamp not working on main beam (1.7.5a) Offside headlamp not working on main beam (1.7.5a) 04 August 2008 [10:42] 04/08/2008 553477518238 553477518238
1 Offside headlamp aim too low and too far to the left. (1.8) Offside headlamp aim too low and too far to the left. (1.8) 04 August 2008 [10:42] 04/08/2008 553477518238 553477518238
1 Horn not working (1.6.2a) Horn not working (1.6.2a) 04 August 2008 [10:42] 04/08/2008 553477518238 553477518238
1 Offside front direction indicator excessively damaged so that it is not visible from a reasonable distance (1.4.a.2e) Offside front direction indicator excessively damaged so that it is not visible from a reasonable distance (1.4.a.2e) 04 August 2008 [10:42] 04/08/2008 553477518238 553477518238
1 Offside rear direction indicator excessively damaged so that it is not visible from a reasonable distance (1.4.a.2e) Offside rear direction indicator excessively damaged so that it is not visible from a reasonable distance (1.4.a.2e) 04 August 2008 [10:42] 04/08/2008 553477518238 553477518238

ALL 312 BWV User Entered Faults [2]

ALL User Entered faults, ORDERED by OCCURRENCE DURING 312 BWV's MOT HISTORY
ALL 312 BWV User Entered Faults [2]
ALL User Entered faults, ORDERED by OCCURRENCE DURING 312 BWV's MOT HISTORY
Advisory Faults | source www.vehiclestats.co.uk
Fault Fault Test Date Test Date/Time Reference MOT Test Reference
1 Oil leak n/s/r hub Oil leak n/s/r hub 19 September 2011 [13:46] 19/09/2011 655382861208 655382861208
1 Oil leak from n/s/r axle oil seal Oil leak from n/s/r axle oil seal 27 June 2006 [14:00] 27/06/2006 154428076173 154428076173

MOT TEST: 05 June 2018 10:28:45 PASSED
MOT TEST: 05 June 2018 10:28:45 PASSED

This test (428359802180) was completed on the 05 June 2018 10:28:45 and PASSED the requirements for a valid MOT with 0 comments.

This test (428359802180) was completed on the 05 June 2018 10:28:45 and PASSED the requirements for a valid MOT with 0 comments.

Recorded mileage: 26,343

Recorded mileage: 26,343


MOT TEST: 11 August 2016 16:23:08 PASSED
MOT TEST: 11 August 2016 16:23:08 PASSED

This test (986101191819) was completed on the 11 August 2016 16:23:08 and PASSED the requirements for a valid MOT with 0 comments.

This test (986101191819) was completed on the 11 August 2016 16:23:08 and PASSED the requirements for a valid MOT with 0 comments.

Recorded mileage: 26,175

Recorded mileage: 26,175


MOT TEST: 01 August 2016 11:29:39 FAILED
MOT TEST: 01 August 2016 11:29:39 FAILED

This test (525755911462) was completed on the 01 August 2016 11:29:39 and FAILED the requirements for a valid MOT with 2 comments.

This test (525755911462) was completed on the 01 August 2016 11:29:39 and FAILED the requirements for a valid MOT with 2 comments.

Recorded mileage: 26,165

Recorded mileage: 26,165


FAIL


MOT TEST: 16 September 2014 15:31:37 PASSED
MOT TEST: 16 September 2014 15:31:37 PASSED

This test (598959254275) was completed on the 16 September 2014 15:31:37 and PASSED the requirements for a valid MOT with 0 comments.

This test (598959254275) was completed on the 16 September 2014 15:31:37 and PASSED the requirements for a valid MOT with 0 comments.

Recorded mileage: 26,058

Recorded mileage: 26,058


MOT TEST: 24 September 2013 16:07:45 PASSED
MOT TEST: 24 September 2013 16:07:45 PASSED

This test (336157263479) was completed on the 24 September 2013 16:07:45 and PASSED the requirements for a valid MOT with 2 comments.

This test (336157263479) was completed on the 24 September 2013 16:07:45 and PASSED the requirements for a valid MOT with 2 comments.

Recorded mileage: 25,791

Recorded mileage: 25,791


ADVISORY


MOT TEST: 26 September 2012 14:28:10 PASSED
MOT TEST: 26 September 2012 14:28:10 PASSED

This test (119030972266) was completed on the 26 September 2012 14:28:10 and PASSED the requirements for a valid MOT with 0 comments.

This test (119030972266) was completed on the 26 September 2012 14:28:10 and PASSED the requirements for a valid MOT with 0 comments.

Recorded mileage: 25,586

Recorded mileage: 25,586


MOT TEST: 19 September 2012 11:47:52 FAILED
MOT TEST: 19 September 2012 11:47:52 FAILED

This test (119973962229) was completed on the 19 September 2012 11:47:52 and FAILED the requirements for a valid MOT with 2 comments.

This test (119973962229) was completed on the 19 September 2012 11:47:52 and FAILED the requirements for a valid MOT with 2 comments.

Recorded mileage: 25,573

Recorded mileage: 25,573


FAIL


MOT TEST: 19 September 2011 13:46:48 PASSED
MOT TEST: 19 September 2011 13:46:48 PASSED

This test (655382861208) was completed on the 19 September 2011 13:46:48 and PASSED the requirements for a valid MOT with 3 comments.

This test (655382861208) was completed on the 19 September 2011 13:46:48 and PASSED the requirements for a valid MOT with 3 comments.

Recorded mileage: 24,919

Recorded mileage: 24,919


ADVISORY

USER ENTERED


MOT TEST: 02 September 2011 09:54:58 FAILED
MOT TEST: 02 September 2011 09:54:58 FAILED

This test (568645541215) was completed on the 02 September 2011 09:54:58 and FAILED the requirements for a valid MOT with 2 comments.

This test (568645541215) was completed on the 02 September 2011 09:54:58 and FAILED the requirements for a valid MOT with 2 comments.

Recorded mileage: 24,909

Recorded mileage: 24,909


FAIL


MOT TEST: 31 August 2010 12:38:42 PASSED
MOT TEST: 31 August 2010 12:38:42 PASSED

This test (841393840286) was completed on the 31 August 2010 12:38:42 and PASSED the requirements for a valid MOT with 2 comments.

This test (841393840286) was completed on the 31 August 2010 12:38:42 and PASSED the requirements for a valid MOT with 2 comments.

Recorded mileage: 24,592

Recorded mileage: 24,592


ADVISORY


MOT TEST: 11 August 2009 10:51:00 PASSED
MOT TEST: 11 August 2009 10:51:00 PASSED

This test (593423429254) was completed on the 11 August 2009 10:51:00 and PASSED the requirements for a valid MOT with 0 comments.

This test (593423429254) was completed on the 11 August 2009 10:51:00 and PASSED the requirements for a valid MOT with 0 comments.

Recorded mileage: 24,293

Recorded mileage: 24,293


MOT TEST: 11 August 2008 09:17:17 PASSED
MOT TEST: 11 August 2008 09:17:17 PASSED

This test (363194828246) was completed on the 11 August 2008 09:17:17 and PASSED the requirements for a valid MOT with 0 comments.

This test (363194828246) was completed on the 11 August 2008 09:17:17 and PASSED the requirements for a valid MOT with 0 comments.

Recorded mileage: 23,984

Recorded mileage: 23,984


MOT TEST: 04 August 2008 10:42:13 FAILED
MOT TEST: 04 August 2008 10:42:13 FAILED

This test (553477518238) was completed on the 04 August 2008 10:42:13 and FAILED the requirements for a valid MOT with 5 comments.

This test (553477518238) was completed on the 04 August 2008 10:42:13 and FAILED the requirements for a valid MOT with 5 comments.

Recorded mileage: 23,951

Recorded mileage: 23,951


FAIL


MOT TEST: 01 August 2007 11:40:57 PASSED
MOT TEST: 01 August 2007 11:40:57 PASSED

This test (974403617221) was completed on the 01 August 2007 11:40:57 and PASSED the requirements for a valid MOT with 0 comments.

This test (974403617221) was completed on the 01 August 2007 11:40:57 and PASSED the requirements for a valid MOT with 0 comments.

Recorded mileage: 23,631

Recorded mileage: 23,631


MOT TEST: 27 June 2006 14:00:27 PASSED
MOT TEST: 27 June 2006 14:00:27 PASSED

This test (154428076173) was completed on the 27 June 2006 14:00:27 and PASSED the requirements for a valid MOT with 1 comments.

This test (154428076173) was completed on the 27 June 2006 14:00:27 and PASSED the requirements for a valid MOT with 1 comments.

Recorded mileage: 23,049

Recorded mileage: 23,049


USER ENTERED