312 UYU


312UYU is registered to a Cream 1961, Morris 1000 with a Petrol engine. It Failed its most recent MOT Test on the 11 December 2017

27 unique faults (33 Total) reported in its MOT History (13 Tests).

6 common/recurring faults, the most frequent (2 times) is: Offside rear brake binding (3.7.B.1).

54% (7) MOT Pass Rate and a 46% (6) MOT Failure Rate.

42,736 recorded miles.

312 UYU


312UYU is registered to a Cream 1961, Morris 1000 with a Petrol engine. It Failed its most recent MOT Test on the 11 December 2017

27 unique faults (33 Total) reported in its MOT History (13 Tests).

6 common/recurring faults, the most frequent (2 times) is: Offside rear brake binding (3.7.B.1).

54% (7) MOT Pass Rate and a 46% (6) MOT Failure Rate.

42,736 recorded miles.

MOT PASS/Failure rate for 312 UYU

all MOT test results for 312 UYU represented as a percentage
MOT PASS/Failure rate for 312 UYU
all MOT test results for 312 UYU represented as a percentage

PERCENTAGE OF VEHICLE FAULTS WITH 312 UYU

ALL REPORTED FAULTS, DISPLAYED BY PERCENTAGE OF OCCURRENCE DURING ALL MOT TESTS
PERCENTAGE OF VEHICLE FAULTS WITH 312 UYU
ALL REPORTED FAULTS, DISPLAYED BY PERCENTAGE OF OCCURRENCE DURING ALL MOT TESTS
ADVISORY

FAIL

USER ENTERED

PASS WITH RECTIFICATION

312 UYU annual Faults by type

ALL REPORTED FAULTS, DISPLAYED over time and categorised by type
312 UYU annual Faults by type
ALL REPORTED FAULTS, DISPLAYED over time and categorised by type

RECURRING FAULTS WITH 312 UYU

FAULTS THAT HAVE OCCURED MORE THAN ONCE DURING 312 UYU's MOT HISTORY
RECURRING FAULTS WITH 312 UYU
FAULTS THAT HAVE OCCURED MORE THAN ONCE DURING 312 UYU's MOT HISTORY
Fault Fault Test Date Test Date/Time Reference MOT Test Reference
2 Offside rear brake binding (3.7.b.1) Offside rear brake binding (3.7.b.1) 06 December 2016 [15:56] 06/12/2016 16 December 2015 [16:30] 16/12/2015 846930664790 846930664790 711015247082 711015247082
2 Brake fluid low Brake fluid low 24 December 2015 [11:45] 24/12/2015 16 December 2015 [16:30] 16/12/2015 798233723947 798233723947 711015247082 711015247082
2 Windscreen washer provides insufficient washer liquid (8.2.3) Windscreen washer provides insufficient washer liquid (8.2.3) 16 December 2015 [16:30] 16/12/2015 27 September 2010 [16:57] 27/09/2010 711015247082 711015247082 600270470200 600270470200
2 Offside headlamp not working on dipped beam (1.7.5a) Offside headlamp not working on dipped beam (1.7.5a) 16 December 2015 [16:30] 16/12/2015 18 September 2009 [08:51] 18/09/2009 711015247082 711015247082 152111669237 152111669237
2 Indicators flashing fast Indicators flashing fast 29 September 2010 [10:38] 29/09/2010 27 September 2010 [16:57] 27/09/2010 271422870258 271422870258 600270470200 600270470200
2 Both rear reflectors and lamp lenses in poor condition Both rear reflectors and lamp lenses in poor condition 18 September 2009 [08:51] 18/09/2009 18 September 2009 [08:51] 18/09/2009 733021769253 733021769253 152111669237 152111669237

ALL 312 UYU ADVISORIES [3]

ALL ADVISORIES, ORDERED by OCCURRENCE DURING 312 UYU's MOT HISTORY
ALL 312 UYU ADVISORIES [3]
ALL ADVISORIES, ORDERED by OCCURRENCE DURING 312 UYU's MOT HISTORY
Advisory Faults | source www.vehiclestats.co.uk
Fault Fault Test Date Test Date/Time Reference MOT Test Reference
2 Brake fluid low Brake fluid low 24 December 2015 [11:45] 24/12/2015 16 December 2015 [16:30] 16/12/2015 798233723947 798233723947 711015247082 711015247082
1 Offside bulb out in reg plate lamp,indicator tell tail incomplete Offside bulb out in reg plate lamp,indicator tell tail incomplete 06 December 2016 [15:56] 06/12/2016 846930664790 846930664790

ALL 312 UYU Failure Faults [20]

ALL Failure faults, ORDERED by OCCURRENCE DURING 312 UYU's MOT HISTORY
ALL 312 UYU Failure Faults [20]
ALL Failure faults, ORDERED by OCCURRENCE DURING 312 UYU's MOT HISTORY
Fail Faults | source www.vehiclestats.co.uk
Fault Fault Test Date Test Date/Time Reference MOT Test Reference
2 Offside rear brake binding (3.7.b.1) Offside rear brake binding (3.7.b.1) 06 December 2016 [15:56] 06/12/2016 16 December 2015 [16:30] 16/12/2015 846930664790 846930664790 711015247082 711015247082
2 Windscreen washer provides insufficient washer liquid (8.2.3) Windscreen washer provides insufficient washer liquid (8.2.3) 16 December 2015 [16:30] 16/12/2015 27 September 2010 [16:57] 27/09/2010 711015247082 711015247082 600270470200 600270470200
1 Parking brake: efficiency below requirements (3.7.b.7) Parking brake: efficiency below requirements (3.7.b.7) 06 December 2016 [15:56] 06/12/2016 846930664790 846930664790
1 Brakes imbalanced across an axle (3.7.b.5b) Brakes imbalanced across an axle (3.7.b.5b) 06 December 2016 [15:56] 06/12/2016 846930664790 846930664790
1 Nearside windscreen washer provides insufficient washer liquid (8.2.3) Nearside windscreen washer provides insufficient washer liquid (8.2.3) 06 December 2016 [15:56] 06/12/2016 846930664790 846930664790
1 Nearside rear parking brake recording little or no effort (3.7.b.6a) Nearside rear parking brake recording little or no effort (3.7.b.6a) 06 December 2016 [15:56] 06/12/2016 846930664790 846930664790
1 Nearside headlamp aim too high (1.8) Nearside headlamp aim too high (1.8) 06 December 2016 [15:56] 06/12/2016 846930664790 846930664790
1 Offside headlamp aim too high (1.8) Offside headlamp aim too high (1.8) 06 December 2016 [15:56] 06/12/2016 846930664790 846930664790
1 Indicator tell tale inoperative (1.4.a.2a) Indicator tell tale inoperative (1.4.a.2a) 06 December 2016 [15:56] 06/12/2016 846930664790 846930664790
1 Windscreen wiper not operating over a large enough area to give an adequate view both (8.2.1c) Windscreen wiper not operating over a large enough area to give an adequate view both (8.2.1c) 16 December 2015 [16:30] 16/12/2015 711015247082 711015247082
1 Offside headlamp not working on dipped beam (1.7.5a) Offside headlamp not working on dipped beam (1.7.5a) 16 December 2015 [16:30] 16/12/2015 711015247082 711015247082
1 Offside headlamp not working on main beam (1.7.5a) Offside headlamp not working on main beam (1.7.5a) 16 December 2015 [16:30] 16/12/2015 711015247082 711015247082
1 Direction indicators flashing more than 120 times a minute (1.4.a.2g) Direction indicators flashing more than 120 times a minute (1.4.a.2g) 16 December 2015 [16:30] 16/12/2015 711015247082 711015247082
1 Brake pedal has insufficient reserve movement (3.3.a.5) Brake pedal has insufficient reserve movement (3.3.a.5) 16 December 2015 [16:30] 16/12/2015 711015247082 711015247082
1 Nearside headlamp not working on dipped beam (1.7.5a) Nearside headlamp not working on dipped beam (1.7.5a) 27 September 2010 [16:57] 27/09/2010 600270470200 600270470200
1 Direction indicator incorrect colour (1.4.a.2f) Direction indicator incorrect colour (1.4.a.2f) 13 June 2007 [14:16] 13/06/2007 264424267113 264424267113
1 Centre rear brake hose excessively deteriorated (3.6.b.4d) Centre rear brake hose excessively deteriorated (3.6.b.4d) 13 June 2007 [14:16] 13/06/2007 264424267113 264424267113
1 Nearside front wheel cylinder securing device missing (3.5.1j) Nearside front wheel cylinder securing device missing (3.5.1j) 13 June 2007 [14:16] 13/06/2007 264424267113 264424267113

ALL 312 UYU User Entered Faults [6]

ALL User Entered faults, ORDERED by OCCURRENCE DURING 312 UYU's MOT HISTORY
ALL 312 UYU User Entered Faults [6]
ALL User Entered faults, ORDERED by OCCURRENCE DURING 312 UYU's MOT HISTORY
User Entered Faults | source www.vehiclestats.co.uk
Fault Fault Test Date Test Date/Time Reference MOT Test Reference
2 Indicators flashing fast Indicators flashing fast 29 September 2010 [10:38] 29/09/2010 27 September 2010 [16:57] 27/09/2010 271422870258 271422870258 600270470200 600270470200
2 Both rear reflectors and lamp lenses in poor condition Both rear reflectors and lamp lenses in poor condition 18 September 2009 [08:51] 18/09/2009 18 September 2009 [08:51] 18/09/2009 733021769253 733021769253 152111669237 152111669237
1 Both rear lamp lenses in poor condition Both rear lamp lenses in poor condition 24 September 2008 [16:50] 24/09/2008 352208268275 352208268275
1 Both front and offside rear brakes binding slightly Both front and offside rear brakes binding slightly 24 September 2008 [16:50] 24/09/2008 352208268275 352208268275

ALL 312 UYU Pass With Rectification Faults [4]

ALL Pass With Rectification faults, ORDERED by OCCURRENCE DURING 312 UYU's MOT HISTORY
ALL 312 UYU Pass With Rectification Faults [4]
ALL Pass With Rectification faults, ORDERED by OCCURRENCE DURING 312 UYU's MOT HISTORY
Pass With Rectification Faults | source www.vehiclestats.co.uk
Fault Fault Test Date Test Date/Time Reference MOT Test Reference
1 Direction indicators not working (1.4.a.2c) Direction indicators not working (1.4.a.2c) 11 December 2017 [15:34] 11/12/2017 984179438476 984179438476
1 Nearside rear tyre not fitted in accordance with side wall instructions (4.1.d.1f) Nearside rear tyre not fitted in accordance with side wall instructions (4.1.d.1f) 11 December 2017 [15:34] 11/12/2017 984179438476 984179438476
1 Offside front tyre not fitted in accordance with side wall instructions (4.1.d.1f) Offside front tyre not fitted in accordance with side wall instructions (4.1.d.1f) 11 December 2017 [15:34] 11/12/2017 984179438476 984179438476
1 Offside headlamp not working on dipped beam (1.7.5a) Offside headlamp not working on dipped beam (1.7.5a) 18 September 2009 [08:51] 18/09/2009 152111669237 152111669237

MOT TEST: 11 December 2017 15:34:57 PASSED
MOT TEST: 11 December 2017 15:34:57 PASSED

This test (692715816751) was completed on the 11 December 2017 15:34:57 and PASSED the requirements for a valid MOT with 0 comments.

This test (692715816751) was completed on the 11 December 2017 15:34:57 and PASSED the requirements for a valid MOT with 0 comments.

Recorded mileage: 42,736

Recorded mileage: 42,736


MOT TEST: 11 December 2017 15:34:56 FAILED
MOT TEST: 11 December 2017 15:34:56 FAILED

This test (984179438476) was completed on the 11 December 2017 15:34:56 and FAILED the requirements for a valid MOT with 3 comments.

This test (984179438476) was completed on the 11 December 2017 15:34:56 and FAILED the requirements for a valid MOT with 3 comments.

Recorded mileage: 42,736

Recorded mileage: 42,736


PASS WITH RECTIFICATION


MOT TEST: 14 December 2016 16:50:37 PASSED
MOT TEST: 14 December 2016 16:50:37 PASSED

This test (618696957528) was completed on the 14 December 2016 16:50:37 and PASSED the requirements for a valid MOT with 0 comments.

This test (618696957528) was completed on the 14 December 2016 16:50:37 and PASSED the requirements for a valid MOT with 0 comments.

Recorded mileage: 42,354

Recorded mileage: 42,354


MOT TEST: 06 December 2016 15:56:37 FAILED
MOT TEST: 06 December 2016 15:56:37 FAILED

This test (846930664790) was completed on the 06 December 2016 15:56:37 and FAILED the requirements for a valid MOT with 9 comments.

This test (846930664790) was completed on the 06 December 2016 15:56:37 and FAILED the requirements for a valid MOT with 9 comments.

Recorded mileage: 42,351

Recorded mileage: 42,351


ADVISORY

FAIL


MOT TEST: 24 December 2015 11:45:01 PASSED
MOT TEST: 24 December 2015 11:45:01 PASSED

This test (798233723947) was completed on the 24 December 2015 11:45:01 and PASSED the requirements for a valid MOT with 1 comments.

This test (798233723947) was completed on the 24 December 2015 11:45:01 and PASSED the requirements for a valid MOT with 1 comments.

Recorded mileage: 42,234

Recorded mileage: 42,234


ADVISORY


MOT TEST: 16 December 2015 16:30:50 FAILED
MOT TEST: 16 December 2015 16:30:50 FAILED

This test (711015247082) was completed on the 16 December 2015 16:30:50 and FAILED the requirements for a valid MOT with 8 comments.

This test (711015247082) was completed on the 16 December 2015 16:30:50 and FAILED the requirements for a valid MOT with 8 comments.

Recorded mileage: 42,225

Recorded mileage: 42,225


ADVISORY

FAIL


MOT TEST: 29 September 2010 10:38:42 PASSED
MOT TEST: 29 September 2010 10:38:42 PASSED

This test (271422870258) was completed on the 29 September 2010 10:38:42 and PASSED the requirements for a valid MOT with 1 comments.

This test (271422870258) was completed on the 29 September 2010 10:38:42 and PASSED the requirements for a valid MOT with 1 comments.

Recorded mileage: 41,597

Recorded mileage: 41,597


USER ENTERED


MOT TEST: 27 September 2010 16:57:49 FAILED
MOT TEST: 27 September 2010 16:57:49 FAILED

This test (600270470200) was completed on the 27 September 2010 16:57:49 and FAILED the requirements for a valid MOT with 3 comments.

This test (600270470200) was completed on the 27 September 2010 16:57:49 and FAILED the requirements for a valid MOT with 3 comments.

Recorded mileage: 41,597

Recorded mileage: 41,597


FAIL

USER ENTERED


MOT TEST: 18 September 2009 08:51:24 PASSED
MOT TEST: 18 September 2009 08:51:24 PASSED

This test (733021769253) was completed on the 18 September 2009 08:51:24 and PASSED the requirements for a valid MOT with 1 comments.

This test (733021769253) was completed on the 18 September 2009 08:51:24 and PASSED the requirements for a valid MOT with 1 comments.

Recorded mileage: 41,553

Recorded mileage: 41,553


USER ENTERED


MOT TEST: 18 September 2009 08:51:24 FAILED
MOT TEST: 18 September 2009 08:51:24 FAILED

This test (152111669237) was completed on the 18 September 2009 08:51:24 and FAILED the requirements for a valid MOT with 2 comments.

This test (152111669237) was completed on the 18 September 2009 08:51:24 and FAILED the requirements for a valid MOT with 2 comments.

Recorded mileage: 41,553

Recorded mileage: 41,553


USER ENTERED

PASS WITH RECTIFICATION


MOT TEST: 24 September 2008 16:50:40 PASSED
MOT TEST: 24 September 2008 16:50:40 PASSED

This test (352208268275) was completed on the 24 September 2008 16:50:40 and PASSED the requirements for a valid MOT with 2 comments.

This test (352208268275) was completed on the 24 September 2008 16:50:40 and PASSED the requirements for a valid MOT with 2 comments.

Recorded mileage: 40,804

Recorded mileage: 40,804


USER ENTERED


MOT TEST: 14 June 2007 14:45:14 PASSED
MOT TEST: 14 June 2007 14:45:14 PASSED

This test (641095167119) was completed on the 14 June 2007 14:45:14 and PASSED the requirements for a valid MOT with 0 comments.

This test (641095167119) was completed on the 14 June 2007 14:45:14 and PASSED the requirements for a valid MOT with 0 comments.

Recorded mileage: 40,570

Recorded mileage: 40,570


MOT TEST: 13 June 2007 14:16:44 FAILED
MOT TEST: 13 June 2007 14:16:44 FAILED

This test (264424267113) was completed on the 13 June 2007 14:16:44 and FAILED the requirements for a valid MOT with 3 comments.

This test (264424267113) was completed on the 13 June 2007 14:16:44 and FAILED the requirements for a valid MOT with 3 comments.

Recorded mileage: 40,570

Recorded mileage: 40,570


FAIL