314 7RE


3147RE is registered to a Blue 1959, Morris Minor with a Petrol engine. It Failed its most recent MOT Test on the 12 June 2009

21 unique faults (23 Total) reported in its MOT History (5 Tests).

1 common/recurring faults.

60% (3) MOT Pass Rate and a 40% (2) MOT Failure Rate.

93,580 recorded miles.

314 7RE


3147RE is registered to a Blue 1959, Morris Minor with a Petrol engine. It Failed its most recent MOT Test on the 12 June 2009

21 unique faults (23 Total) reported in its MOT History (5 Tests).

1 common/recurring faults.

60% (3) MOT Pass Rate and a 40% (2) MOT Failure Rate.

93,580 recorded miles.

MOT PASS/Failure rate for 314 7RE

all MOT test results for 314 7RE represented as a percentage
MOT PASS/Failure rate for 314 7RE
all MOT test results for 314 7RE represented as a percentage

PERCENTAGE OF VEHICLE FAULTS WITH 314 7RE

ALL REPORTED FAULTS, DISPLAYED BY PERCENTAGE OF OCCURRENCE DURING ALL MOT TESTS
PERCENTAGE OF VEHICLE FAULTS WITH 314 7RE
ALL REPORTED FAULTS, DISPLAYED BY PERCENTAGE OF OCCURRENCE DURING ALL MOT TESTS
FAIL

314 7RE annual Faults by type

ALL REPORTED FAULTS, DISPLAYED over time and categorised by type
314 7RE annual Faults by type
ALL REPORTED FAULTS, DISPLAYED over time and categorised by type

ALL 314 7RE Failure Faults [23]

ALL Failure faults, ORDERED by OCCURRENCE DURING 314 7RE's MOT HISTORY
ALL 314 7RE Failure Faults [23]
ALL Failure faults, ORDERED by OCCURRENCE DURING 314 7RE's MOT HISTORY
Fail Faults | source www.vehiclestats.co.uk
Fault Fault Test Date Test Date/Time Reference MOT Test Reference
2 Parking brake: efficiency below requirements (3.7.b.7) Parking brake: efficiency below requirements (3.7.b.7) 14 November 2007 [16:43] 14/11/2007 20 March 2007 [17:03] 20/03/2007 430348917496 430348917496 193309377459 193309377459
1 Offside front brake pipe excessively corroded (3.6.b.2c) Offside front brake pipe excessively corroded (3.6.b.2c) 14 November 2007 [16:43] 14/11/2007 430348917496 430348917496
1 Nearside windscreen washer provides insufficient washer liquid (8.2.3) Nearside windscreen washer provides insufficient washer liquid (8.2.3) 20 March 2007 [17:03] 20/03/2007 193309377459 193309377459
1 Nearside headlamp excessively damaged so that the light output is severely reduced (1.7.5a) Nearside headlamp excessively damaged so that the light output is severely reduced (1.7.5a) 20 March 2007 [17:03] 20/03/2007 193309377459 193309377459
1 Offside headlamp excessively damaged so that the light output is severely reduced (1.7.5a) Offside headlamp excessively damaged so that the light output is severely reduced (1.7.5a) 20 March 2007 [17:03] 20/03/2007 193309377459 193309377459
1 Offside steering rack gaiter split (2.2.d.2d) Offside steering rack gaiter split (2.2.d.2d) 20 March 2007 [17:03] 20/03/2007 193309377459 193309377459
1 Nearside front suspension has excessive play in a upper suspension ball joint (2.5.b.1a) Nearside front suspension has excessive play in a upper suspension ball joint (2.5.b.1a) 20 March 2007 [17:03] 20/03/2007 193309377459 193309377459
1 Offside front suspension has excessive play in a lower suspension ball joint (2.5.b.1a) Offside front suspension has excessive play in a lower suspension ball joint (2.5.b.1a) 20 March 2007 [17:03] 20/03/2007 193309377459 193309377459
1 Centre brake pipe excessively corroded (3.6.b.2c) Centre brake pipe excessively corroded (3.6.b.2c) 20 March 2007 [17:03] 20/03/2007 193309377459 193309377459
1 Offside rear brake recording little or no effort (3.7.b.5a) Offside rear brake recording little or no effort (3.7.b.5a) 20 March 2007 [17:03] 20/03/2007 193309377459 193309377459
1 Offside rear parking brake recording little or no effort (3.7.b.6a) Offside rear parking brake recording little or no effort (3.7.b.6a) 20 March 2007 [17:03] 20/03/2007 193309377459 193309377459
1 Front exhaust has a major leak of exhaust gases (7.1.2) Front exhaust has a major leak of exhaust gases (7.1.2) 20 March 2007 [17:03] 20/03/2007 193309377459 193309377459
1 Centre exhaust system not adequately supported (7.1.1) Centre exhaust system not adequately supported (7.1.1) 20 March 2007 [17:03] 20/03/2007 193309377459 193309377459
1 Nearside rear suspension spring mounting prescribed area is excessively corroded (2.4.a.3) Nearside rear suspension spring mounting prescribed area is excessively corroded (2.4.a.3) 20 March 2007 [17:03] 20/03/2007 193309377459 193309377459
1 Offside rear suspension spring mounting prescribed area is excessively corroded (2.4.a.3) Offside rear suspension spring mounting prescribed area is excessively corroded (2.4.a.3) 20 March 2007 [17:03] 20/03/2007 193309377459 193309377459
1 Nearside front suspension component mounting prescribed area is excessively corroded (2.4.a.3) Nearside front suspension component mounting prescribed area is excessively corroded (2.4.a.3) 20 March 2007 [17:03] 20/03/2007 193309377459 193309377459
1 Offside suspension component mounting prescribed area is excessively corroded (2.4.a.3) Offside suspension component mounting prescribed area is excessively corroded (2.4.a.3) 20 March 2007 [17:03] 20/03/2007 193309377459 193309377459
1 Centre suspension component mounting prescribed area is excessively corroded (2.4.a.3) Centre suspension component mounting prescribed area is excessively corroded (2.4.a.3) 20 March 2007 [17:03] 20/03/2007 193309377459 193309377459
1 Offside front upper suspension component mounting prescribed area is excessively corroded (2.4.a.3) Offside front upper suspension component mounting prescribed area is excessively corroded (2.4.a.3) 20 March 2007 [17:03] 20/03/2007 193309377459 193309377459
1 Nearside front body has a sharp edge caused by corrosion (6.1.c.1) Nearside front body has a sharp edge caused by corrosion (6.1.c.1) 20 March 2007 [17:03] 20/03/2007 193309377459 193309377459
1 Brakes imbalanced across an axle (3.7.b.5b) Brakes imbalanced across an axle (3.7.b.5b) 20 March 2007 [17:03] 20/03/2007 193309377459 193309377459

MOT TEST: 12 June 2009 11:42:11 PASSED
MOT TEST: 12 June 2009 11:42:11 PASSED

This test (322043869188) was completed on the 12 June 2009 11:42:11 and PASSED the requirements for a valid MOT with 0 comments.

This test (322043869188) was completed on the 12 June 2009 11:42:11 and PASSED the requirements for a valid MOT with 0 comments.

Recorded mileage: 25,264

Recorded mileage: 25,264


MOT TEST: 19 November 2007 16:24:20 PASSED
MOT TEST: 19 November 2007 16:24:20 PASSED

This test (580233127319) was completed on the 19 November 2007 16:24:20 and PASSED the requirements for a valid MOT with 0 comments.

This test (580233127319) was completed on the 19 November 2007 16:24:20 and PASSED the requirements for a valid MOT with 0 comments.

Recorded mileage: 24,713

Recorded mileage: 24,713


MOT TEST: 14 November 2007 16:43:59 FAILED
MOT TEST: 14 November 2007 16:43:59 FAILED

This test (430348917496) was completed on the 14 November 2007 16:43:59 and FAILED the requirements for a valid MOT with 2 comments.

This test (430348917496) was completed on the 14 November 2007 16:43:59 and FAILED the requirements for a valid MOT with 2 comments.

Recorded mileage: 24,711

Recorded mileage: 24,711


FAIL


MOT TEST: 20 March 2007 17:03:30 FAILED
MOT TEST: 20 March 2007 17:03:30 FAILED

This test (193309377459) was completed on the 20 March 2007 17:03:30 and FAILED the requirements for a valid MOT with 21 comments.

This test (193309377459) was completed on the 20 March 2007 17:03:30 and FAILED the requirements for a valid MOT with 21 comments.

Recorded mileage: 24,478

Recorded mileage: 24,478


FAIL


MOT TEST: 23 March 2006 15:33:56 PASSED
MOT TEST: 23 March 2006 15:33:56 PASSED

This test (494992186011) was completed on the 23 March 2006 15:33:56 and PASSED the requirements for a valid MOT with 0 comments.

This test (494992186011) was completed on the 23 March 2006 15:33:56 and PASSED the requirements for a valid MOT with 0 comments.

Recorded mileage: 93,580

Recorded mileage: 93,580