314 UYM


314UYM is registered to a Red 1960, Morris Minor 1000 with a Petrol engine. It Failed its most recent MOT Test on the 06 December 2017

3 unique faults (3 Total) reported in its MOT History (7 Tests).

0 common/recurring faults.

86% (6) MOT Pass Rate and a 14% (1) MOT Failure Rate.

1,391 recorded miles.

314 UYM


314UYM is registered to a Red 1960, Morris Minor 1000 with a Petrol engine. It Failed its most recent MOT Test on the 06 December 2017

3 unique faults (3 Total) reported in its MOT History (7 Tests).

0 common/recurring faults.

86% (6) MOT Pass Rate and a 14% (1) MOT Failure Rate.

1,391 recorded miles.

MOT PASS/Failure rate for 314 UYM

all MOT test results for 314 UYM represented as a percentage
MOT PASS/Failure rate for 314 UYM
all MOT test results for 314 UYM represented as a percentage

PERCENTAGE OF VEHICLE FAULTS WITH 314 UYM

ALL REPORTED FAULTS, DISPLAYED BY PERCENTAGE OF OCCURRENCE DURING ALL MOT TESTS
PERCENTAGE OF VEHICLE FAULTS WITH 314 UYM
ALL REPORTED FAULTS, DISPLAYED BY PERCENTAGE OF OCCURRENCE DURING ALL MOT TESTS
FAIL

USER ENTERED

314 UYM annual Faults by type

ALL REPORTED FAULTS, DISPLAYED over time and categorised by type
314 UYM annual Faults by type
ALL REPORTED FAULTS, DISPLAYED over time and categorised by type

ALL 314 UYM Failure Faults [2]

ALL Failure faults, ORDERED by OCCURRENCE DURING 314 UYM's MOT HISTORY
ALL 314 UYM Failure Faults [2]
ALL Failure faults, ORDERED by OCCURRENCE DURING 314 UYM's MOT HISTORY
Fail Faults | source www.vehiclestats.co.uk
Fault Fault Test Date Test Date/Time Reference MOT Test Reference
1 Nearside front brake pipe excessively corroded (3.6.b.2c) Nearside front brake pipe excessively corroded (3.6.b.2c) 07 July 2006 [17:18] 07/07/2006 262248186487 262248186487
1 Parking brake: efficiency below requirements (3.7.b.7) Parking brake: efficiency below requirements (3.7.b.7) 07 July 2006 [17:18] 07/07/2006 262248186487 262248186487

ALL 314 UYM User Entered Faults [1]

ALL User Entered faults, ORDERED by OCCURRENCE DURING 314 UYM's MOT HISTORY
ALL 314 UYM User Entered Faults [1]
ALL User Entered faults, ORDERED by OCCURRENCE DURING 314 UYM's MOT HISTORY
User Entered Faults | source www.vehiclestats.co.uk
Fault Fault Test Date Test Date/Time Reference MOT Test Reference
1 Surface corrosion underbody Surface corrosion underbody 08 June 2012 [15:15] 08/06/2012 226000862141 226000862141

MOT TEST: 06 December 2017 09:58:25 PASSED
MOT TEST: 06 December 2017 09:58:25 PASSED

This test (383633348515) was completed on the 06 December 2017 09:58:25 and PASSED the requirements for a valid MOT with 0 comments.

This test (383633348515) was completed on the 06 December 2017 09:58:25 and PASSED the requirements for a valid MOT with 0 comments.

Recorded mileage: 1,391

Recorded mileage: 1,391


MOT TEST: 01 November 2016 15:02:47 PASSED
MOT TEST: 01 November 2016 15:02:47 PASSED

This test (450465767989) was completed on the 01 November 2016 15:02:47 and PASSED the requirements for a valid MOT with 0 comments.

This test (450465767989) was completed on the 01 November 2016 15:02:47 and PASSED the requirements for a valid MOT with 0 comments.

Recorded mileage: 1,355

Recorded mileage: 1,355


MOT TEST: 22 October 2015 16:51:40 PASSED
MOT TEST: 22 October 2015 16:51:40 PASSED

This test (789010612349) was completed on the 22 October 2015 16:51:40 and PASSED the requirements for a valid MOT with 0 comments.

This test (789010612349) was completed on the 22 October 2015 16:51:40 and PASSED the requirements for a valid MOT with 0 comments.

Recorded mileage: 1,355

Recorded mileage: 1,355


MOT TEST: 21 October 2014 17:57:18 PASSED
MOT TEST: 21 October 2014 17:57:18 PASSED

This test (875884694203) was completed on the 21 October 2014 17:57:18 and PASSED the requirements for a valid MOT with 0 comments.

This test (875884694203) was completed on the 21 October 2014 17:57:18 and PASSED the requirements for a valid MOT with 0 comments.

Recorded mileage: 1,349

Recorded mileage: 1,349


MOT TEST: 21 November 2013 10:36:21 PASSED
MOT TEST: 21 November 2013 10:36:21 PASSED

This test (339005923323) was completed on the 21 November 2013 10:36:21 and PASSED the requirements for a valid MOT with 0 comments.

This test (339005923323) was completed on the 21 November 2013 10:36:21 and PASSED the requirements for a valid MOT with 0 comments.

Recorded mileage: 1,341

Recorded mileage: 1,341


MOT TEST: 08 June 2012 15:15:18 PASSED
MOT TEST: 08 June 2012 15:15:18 PASSED

This test (226000862141) was completed on the 08 June 2012 15:15:18 and PASSED the requirements for a valid MOT with 1 comments.

This test (226000862141) was completed on the 08 June 2012 15:15:18 and PASSED the requirements for a valid MOT with 1 comments.

Recorded mileage: 1,311

Recorded mileage: 1,311


USER ENTERED


MOT TEST: 07 July 2006 17:18:15 FAILED
MOT TEST: 07 July 2006 17:18:15 FAILED

This test (262248186487) was completed on the 07 July 2006 17:18:15 and FAILED the requirements for a valid MOT with 2 comments.

This test (262248186487) was completed on the 07 July 2006 17:18:15 and FAILED the requirements for a valid MOT with 2 comments.

Recorded mileage: 1,295

Recorded mileage: 1,295


FAIL