315 UXJ


315UXJ is registered to a Green 1961, Morris Minor 1000 with a Petrol engine. It Failed its most recent MOT Test on the 12 June 2014

11 unique faults (12 Total) reported in its MOT History (5 Tests).

1 common/recurring faults.

60% (3) MOT Pass Rate and a 40% (2) MOT Failure Rate.

39,605 recorded miles.

315 UXJ


315UXJ is registered to a Green 1961, Morris Minor 1000 with a Petrol engine. It Failed its most recent MOT Test on the 12 June 2014

11 unique faults (12 Total) reported in its MOT History (5 Tests).

1 common/recurring faults.

60% (3) MOT Pass Rate and a 40% (2) MOT Failure Rate.

39,605 recorded miles.

MOT PASS/Failure rate for 315 UXJ

all MOT test results for 315 UXJ represented as a percentage
MOT PASS/Failure rate for 315 UXJ
all MOT test results for 315 UXJ represented as a percentage

PERCENTAGE OF VEHICLE FAULTS WITH 315 UXJ

ALL REPORTED FAULTS, DISPLAYED BY PERCENTAGE OF OCCURRENCE DURING ALL MOT TESTS
PERCENTAGE OF VEHICLE FAULTS WITH 315 UXJ
ALL REPORTED FAULTS, DISPLAYED BY PERCENTAGE OF OCCURRENCE DURING ALL MOT TESTS
ADVISORY

FAIL

315 UXJ annual Faults by type

ALL REPORTED FAULTS, DISPLAYED over time and categorised by type
315 UXJ annual Faults by type
ALL REPORTED FAULTS, DISPLAYED over time and categorised by type

ALL 315 UXJ ADVISORIES [1]

ALL ADVISORIES, ORDERED by OCCURRENCE DURING 315 UXJ's MOT HISTORY
ALL 315 UXJ ADVISORIES [1]
ALL ADVISORIES, ORDERED by OCCURRENCE DURING 315 UXJ's MOT HISTORY
Fail Faults | source www.vehiclestats.co.uk
Fault Fault Test Date Test Date/Time Reference MOT Test Reference
1 Nearside rear parking brake: parking brake efficiency only just met. It would appear that the braking system requires adjustment or repair. (3.7.b.7) Nearside rear parking brake: parking brake efficiency only just met. It would appear that the braking system requires adjustment or repair. (3.7.b.7) 24 January 2006 [15:38] 24/01/2006 204914826048 204914826048

ALL 315 UXJ Failure Faults [11]

ALL Failure faults, ORDERED by OCCURRENCE DURING 315 UXJ's MOT HISTORY
ALL 315 UXJ Failure Faults [11]
ALL Failure faults, ORDERED by OCCURRENCE DURING 315 UXJ's MOT HISTORY
Fail Faults | source www.vehiclestats.co.uk
Fault Fault Test Date Test Date/Time Reference MOT Test Reference
2 Nearside front tyre tread depth below requirements of 1.6mm (4.1.e.1) Nearside front tyre tread depth below requirements of 1.6mm (4.1.e.1) 20 October 2011 [10:34] 20/10/2011 24 January 2006 [15:38] 24/01/2006 515453391257 515453391257 204914826048 204914826048
1 Offside headlamp not working on dipped beam (1.7.5a) Offside headlamp not working on dipped beam (1.7.5a) 20 October 2011 [10:34] 20/10/2011 515453391257 515453391257
1 Offside headlamp not working on main beam (1.7.5a) Offside headlamp not working on main beam (1.7.5a) 20 October 2011 [10:34] 20/10/2011 515453391257 515453391257
1 Brake pedal spongy (3.3.b.1b) Brake pedal spongy (3.3.b.1b) 20 October 2011 [10:34] 20/10/2011 515453391257 515453391257
1 Front tyre(s) incorrect because tyres with different structures are fitted across the same axle (4.1.a.2a) Front tyre(s) incorrect because tyres with different structures are fitted across the same axle (4.1.a.2a) 20 October 2011 [10:34] 20/10/2011 515453391257 515453391257
1 Nearside front steering rack gaiter split (2.2.d.2d) Nearside front steering rack gaiter split (2.2.d.2d) 24 January 2006 [15:38] 24/01/2006 204914826048 204914826048
1 Offside front steering rack gaiter split (2.2.d.2d) Offside front steering rack gaiter split (2.2.d.2d) 24 January 2006 [15:38] 24/01/2006 204914826048 204914826048
1 Offside front tyre tread depth below requirements of 1.6mm (4.1.e.1) Offside front tyre tread depth below requirements of 1.6mm (4.1.e.1) 24 January 2006 [15:38] 24/01/2006 204914826048 204914826048
1 Nearside front wheel bearing rough when rotated (2.5.a.2) Nearside front wheel bearing rough when rotated (2.5.a.2) 24 January 2006 [15:38] 24/01/2006 204914826048 204914826048
1 Parking brake: efficiency below requirements (3.7.b.7) Parking brake: efficiency below requirements (3.7.b.7) 24 January 2006 [15:38] 24/01/2006 204914826048 204914826048

MOT TEST: 12 June 2014 16:27:57 PASSED
MOT TEST: 12 June 2014 16:27:57 PASSED

This test (248713364471) was completed on the 12 June 2014 16:27:57 and PASSED the requirements for a valid MOT with 0 comments.

This test (248713364471) was completed on the 12 June 2014 16:27:57 and PASSED the requirements for a valid MOT with 0 comments.

Recorded mileage: 39,605

Recorded mileage: 39,605


MOT TEST: 27 October 2011 11:32:39 PASSED
MOT TEST: 27 October 2011 11:32:39 PASSED

This test (559320101389) was completed on the 27 October 2011 11:32:39 and PASSED the requirements for a valid MOT with 0 comments.

This test (559320101389) was completed on the 27 October 2011 11:32:39 and PASSED the requirements for a valid MOT with 0 comments.

Recorded mileage: 39,581

Recorded mileage: 39,581


MOT TEST: 20 October 2011 10:34:42 FAILED
MOT TEST: 20 October 2011 10:34:42 FAILED

This test (515453391257) was completed on the 20 October 2011 10:34:42 and FAILED the requirements for a valid MOT with 5 comments.

This test (515453391257) was completed on the 20 October 2011 10:34:42 and FAILED the requirements for a valid MOT with 5 comments.

Recorded mileage: 39,581

Recorded mileage: 39,581


FAIL


MOT TEST: 30 January 2006 18:49:07 PASSED
MOT TEST: 30 January 2006 18:49:07 PASSED

This test (613250436039) was completed on the 30 January 2006 18:49:07 and PASSED the requirements for a valid MOT with 0 comments.

This test (613250436039) was completed on the 30 January 2006 18:49:07 and PASSED the requirements for a valid MOT with 0 comments.

Recorded mileage: 31,989

Recorded mileage: 31,989


MOT TEST: 24 January 2006 15:38:44 FAILED
MOT TEST: 24 January 2006 15:38:44 FAILED

This test (204914826048) was completed on the 24 January 2006 15:38:44 and FAILED the requirements for a valid MOT with 7 comments.

This test (204914826048) was completed on the 24 January 2006 15:38:44 and FAILED the requirements for a valid MOT with 7 comments.

Recorded mileage: 31,989

Recorded mileage: 31,989


ADVISORY

FAIL