316 UXY


316UXY is registered to a Green 1959, Morris Minor with a Petrol engine. It Failed its most recent MOT Test on the 13 November 2013

13 unique faults (13 Total) reported in its MOT History (5 Tests).

0 common/recurring faults.

60% (3) MOT Pass Rate and a 40% (2) MOT Failure Rate.

25,422 recorded miles.

316 UXY


316UXY is registered to a Green 1959, Morris Minor with a Petrol engine. It Failed its most recent MOT Test on the 13 November 2013

13 unique faults (13 Total) reported in its MOT History (5 Tests).

0 common/recurring faults.

60% (3) MOT Pass Rate and a 40% (2) MOT Failure Rate.

25,422 recorded miles.

MOT PASS/Failure rate for 316 UXY

all MOT test results for 316 UXY represented as a percentage
MOT PASS/Failure rate for 316 UXY
all MOT test results for 316 UXY represented as a percentage

PERCENTAGE OF VEHICLE FAULTS WITH 316 UXY

ALL REPORTED FAULTS, DISPLAYED BY PERCENTAGE OF OCCURRENCE DURING ALL MOT TESTS
PERCENTAGE OF VEHICLE FAULTS WITH 316 UXY
ALL REPORTED FAULTS, DISPLAYED BY PERCENTAGE OF OCCURRENCE DURING ALL MOT TESTS
FAIL

USER ENTERED

316 UXY annual Faults by type

ALL REPORTED FAULTS, DISPLAYED over time and categorised by type
316 UXY annual Faults by type
ALL REPORTED FAULTS, DISPLAYED over time and categorised by type

ALL 316 UXY Failure Faults [12]

ALL Failure faults, ORDERED by OCCURRENCE DURING 316 UXY's MOT HISTORY
ALL 316 UXY Failure Faults [12]
ALL Failure faults, ORDERED by OCCURRENCE DURING 316 UXY's MOT HISTORY
Fail Faults | source www.vehiclestats.co.uk
Fault Fault Test Date Test Date/Time Reference MOT Test Reference
1 Nearside rear braking system leaking (3.6.a.1) Nearside rear braking system leaking (3.6.a.1) 12 November 2013 [17:31] 12/11/2013 938526413328 938526413328
1 Offside front hydraulic brake cylinder leaking hydraulic fluid (3.6.a.1) Offside front hydraulic brake cylinder leaking hydraulic fluid (3.6.a.1) 12 November 2013 [17:31] 12/11/2013 938526413328 938526413328
1 Offside front brake recording little or no effort (3.7.b.5a) Offside front brake recording little or no effort (3.7.b.5a) 12 November 2013 [17:31] 12/11/2013 938526413328 938526413328
1 Brakes imbalanced across an axle (3.7.b.5b) Brakes imbalanced across an axle (3.7.b.5b) 12 November 2013 [17:31] 12/11/2013 938526413328 938526413328
1 Dipswitch operation does not extinguish all main beam headlamps leaving at least one pair of dipped beam headlamps (1.7.4b) Dipswitch operation does not extinguish all main beam headlamps leaving at least one pair of dipped beam headlamps (1.7.4b) 10 October 2012 [14:46] 10/10/2012 518804782247 518804782247
1 Offside headlamp aim too high (1.8) Offside headlamp aim too high (1.8) 10 October 2012 [14:46] 10/10/2012 518804782247 518804782247
1 Nearside headlamp aim too low (1.8) Nearside headlamp aim too low (1.8) 10 October 2012 [14:46] 10/10/2012 518804782247 518804782247
1 Nearside front brake binding (3.7.b.1) Nearside front brake binding (3.7.b.1) 10 October 2012 [14:46] 10/10/2012 518804782247 518804782247
1 Nearside rear brake binding (3.7.b.1) Nearside rear brake binding (3.7.b.1) 10 October 2012 [14:46] 10/10/2012 518804782247 518804782247
1 Nearside rear brake recording little or no effort (3.7.b.5a) Nearside rear brake recording little or no effort (3.7.b.5a) 10 October 2012 [14:46] 10/10/2012 518804782247 518804782247
1 Nearside rear parking brake recording little or no effort (3.7.b.6a) Nearside rear parking brake recording little or no effort (3.7.b.6a) 10 October 2012 [14:46] 10/10/2012 518804782247 518804782247
1 Parking brake: efficiency below requirements (3.7.b.7) Parking brake: efficiency below requirements (3.7.b.7) 10 October 2012 [14:46] 10/10/2012 518804782247 518804782247

ALL 316 UXY User Entered Faults [1]

ALL User Entered faults, ORDERED by OCCURRENCE DURING 316 UXY's MOT HISTORY
ALL 316 UXY User Entered Faults [1]
ALL User Entered faults, ORDERED by OCCURRENCE DURING 316 UXY's MOT HISTORY
Fail Faults | source www.vehiclestats.co.uk
Fault Fault Test Date Test Date/Time Reference MOT Test Reference
1 No headlamp tell-tail No headlamp tell-tail 10 October 2012 [14:46] 10/10/2012 518804782247 518804782247

MOT TEST: 13 November 2013 17:04:29 PASSED
MOT TEST: 13 November 2013 17:04:29 PASSED

This test (389637313342) was completed on the 13 November 2013 17:04:29 and PASSED the requirements for a valid MOT with 0 comments.

This test (389637313342) was completed on the 13 November 2013 17:04:29 and PASSED the requirements for a valid MOT with 0 comments.

Recorded mileage: 25,422

Recorded mileage: 25,422


MOT TEST: 12 November 2013 17:31:28 FAILED
MOT TEST: 12 November 2013 17:31:28 FAILED

This test (938526413328) was completed on the 12 November 2013 17:31:28 and FAILED the requirements for a valid MOT with 4 comments.

This test (938526413328) was completed on the 12 November 2013 17:31:28 and FAILED the requirements for a valid MOT with 4 comments.

Recorded mileage: 25,422

Recorded mileage: 25,422


FAIL


MOT TEST: 11 October 2012 17:02:18 PASSED
MOT TEST: 11 October 2012 17:02:18 PASSED

This test (609645282288) was completed on the 11 October 2012 17:02:18 and PASSED the requirements for a valid MOT with 0 comments.

This test (609645282288) was completed on the 11 October 2012 17:02:18 and PASSED the requirements for a valid MOT with 0 comments.

Recorded mileage: 25,342

Recorded mileage: 25,342


MOT TEST: 10 October 2012 14:46:24 FAILED
MOT TEST: 10 October 2012 14:46:24 FAILED

This test (518804782247) was completed on the 10 October 2012 14:46:24 and FAILED the requirements for a valid MOT with 9 comments.

This test (518804782247) was completed on the 10 October 2012 14:46:24 and FAILED the requirements for a valid MOT with 9 comments.

Recorded mileage: 25,342

Recorded mileage: 25,342


FAIL

USER ENTERED


MOT TEST: 24 July 2006 14:04:02 PASSED
MOT TEST: 24 July 2006 14:04:02 PASSED

This test (601705306211) was completed on the 24 July 2006 14:04:02 and PASSED the requirements for a valid MOT with 0 comments.

This test (601705306211) was completed on the 24 July 2006 14:04:02 and PASSED the requirements for a valid MOT with 0 comments.

Recorded mileage: 25,233

Recorded mileage: 25,233