323 TMU


323TMU is registered to a Cream 1959, Morris Minor with a Petrol engine. It Failed its most recent MOT Test on the 19 March 2012

25 unique faults (27 Total) reported in its MOT History (5 Tests).

2 common/recurring faults, the most frequent (2 times) is: osf inner sill corroded. nsf inner sill corroded,.

60% (3) MOT Pass Rate and a 40% (2) MOT Failure Rate.

21,578 recorded miles.

323 TMU


323TMU is registered to a Cream 1959, Morris Minor with a Petrol engine. It Failed its most recent MOT Test on the 19 March 2012

25 unique faults (27 Total) reported in its MOT History (5 Tests).

2 common/recurring faults, the most frequent (2 times) is: osf inner sill corroded. nsf inner sill corroded,.

60% (3) MOT Pass Rate and a 40% (2) MOT Failure Rate.

21,578 recorded miles.

MOT PASS/Failure rate for 323 TMU

all MOT test results for 323 TMU represented as a percentage
MOT PASS/Failure rate for 323 TMU
all MOT test results for 323 TMU represented as a percentage

PERCENTAGE OF VEHICLE FAULTS WITH 323 TMU

ALL REPORTED FAULTS, DISPLAYED BY PERCENTAGE OF OCCURRENCE DURING ALL MOT TESTS
PERCENTAGE OF VEHICLE FAULTS WITH 323 TMU
ALL REPORTED FAULTS, DISPLAYED BY PERCENTAGE OF OCCURRENCE DURING ALL MOT TESTS
ADVISORY

FAIL

USER ENTERED

323 TMU annual Faults by type

ALL REPORTED FAULTS, DISPLAYED over time and categorised by type
323 TMU annual Faults by type
ALL REPORTED FAULTS, DISPLAYED over time and categorised by type

RECURRING FAULTS WITH 323 TMU

FAULTS THAT HAVE OCCURED MORE THAN ONCE DURING 323 TMU's MOT HISTORY
RECURRING FAULTS WITH 323 TMU
FAULTS THAT HAVE OCCURED MORE THAN ONCE DURING 323 TMU's MOT HISTORY
Fault Fault Test Date Test Date/Time Reference MOT Test Reference
2 Osf inner sill corroded. Nsf inner sill corroded, Osf inner sill corroded. Nsf inner sill corroded, 19 March 2012 [16:48] 19/03/2012 15 March 2012 [15:54] 15/03/2012 898779672089 898779672089 746815472031 746815472031
2 Brakes imbalanced across an axle (3.7.b.5b) Brakes imbalanced across an axle (3.7.b.5b) 15 March 2012 [15:54] 15/03/2012 13 March 2006 [16:22] 13/03/2006 746815472031 746815472031 863832576048 863832576048

ALL 323 TMU ADVISORIES [3]

ALL ADVISORIES, ORDERED by OCCURRENCE DURING 323 TMU's MOT HISTORY
ALL 323 TMU ADVISORIES [3]
ALL ADVISORIES, ORDERED by OCCURRENCE DURING 323 TMU's MOT HISTORY
Advisory Faults | source www.vehiclestats.co.uk
Fault Fault Test Date Test Date/Time Reference MOT Test Reference
1 Offside front brake master cylinder/servo mounting prescribed area is corroded but not considered excessive (3.6.c.3) Offside front brake master cylinder/servo mounting prescribed area is corroded but not considered excessive (3.6.c.3) 19 March 2012 [16:48] 19/03/2012 898779672089 898779672089
1 Offside front brake actuating linkage mounting prescribed area is distorted but not considered excessive (3.3.a.2) Offside front brake actuating linkage mounting prescribed area is distorted but not considered excessive (3.3.a.2) 15 March 2012 [15:54] 15/03/2012 746815472031 746815472031
1 Offside rear shock absorber has a slightly worn shock absorber pivot (2.7.4) Offside rear shock absorber has a slightly worn shock absorber pivot (2.7.4) 13 March 2006 [16:22] 13/03/2006 863832576048 863832576048

ALL 323 TMU Failure Faults [22]

ALL Failure faults, ORDERED by OCCURRENCE DURING 323 TMU's MOT HISTORY
ALL 323 TMU Failure Faults [22]
ALL Failure faults, ORDERED by OCCURRENCE DURING 323 TMU's MOT HISTORY
Fail Faults | source www.vehiclestats.co.uk
Fault Fault Test Date Test Date/Time Reference MOT Test Reference
2 Brakes imbalanced across an axle (3.7.b.5b) Brakes imbalanced across an axle (3.7.b.5b) 15 March 2012 [15:54] 15/03/2012 13 March 2006 [16:22] 13/03/2006 746815472031 746815472031 863832576048 863832576048
1 Nearside rear upper leaf spring to axle securing nut insecure (2.4.b.7b) Nearside rear upper leaf spring to axle securing nut insecure (2.4.b.7b) 15 March 2012 [15:54] 15/03/2012 746815472031 746815472031
1 Offside front upper leaf spring to axle securing nut insecure (2.4.b.7b) Offside front upper leaf spring to axle securing nut insecure (2.4.b.7b) 15 March 2012 [15:54] 15/03/2012 746815472031 746815472031
1 Nearside rear suspension spring mounting prescribed area is inadequately repaired (2.4.a.3) Nearside rear suspension spring mounting prescribed area is inadequately repaired (2.4.a.3) 15 March 2012 [15:54] 15/03/2012 746815472031 746815472031
1 Offside front front brake recording little or no effort (3.7.b.5a) Offside front front brake recording little or no effort (3.7.b.5a) 15 March 2012 [15:54] 15/03/2012 746815472031 746815472031
1 Offside front brake binding (3.7.b.1) Offside front brake binding (3.7.b.1) 15 March 2012 [15:54] 15/03/2012 746815472031 746815472031
1 Offside rear rear brake recording little or no effort (3.7.b.5a) Offside rear rear brake recording little or no effort (3.7.b.5a) 15 March 2012 [15:54] 15/03/2012 746815472031 746815472031
1 Offside rear rear parking brake recording little or no effort (3.7.b.6a) Offside rear rear parking brake recording little or no effort (3.7.b.6a) 15 March 2012 [15:54] 15/03/2012 746815472031 746815472031
1 Service brake: efficiency below requirements (3.7.b.7) Service brake: efficiency below requirements (3.7.b.7) 15 March 2012 [15:54] 15/03/2012 746815472031 746815472031
1 Parking brake: efficiency below requirements (3.7.b.7) Parking brake: efficiency below requirements (3.7.b.7) 15 March 2012 [15:54] 15/03/2012 746815472031 746815472031
1 Offside semaphore indicator arm does not extend smoothly (1.4.c.1a) Offside semaphore indicator arm does not extend smoothly (1.4.c.1a) 13 March 2006 [16:22] 13/03/2006 863832576048 863832576048
1 Offside semaphore indicator arm arm does not show an amber light to the front (1.4.c.1b) Offside semaphore indicator arm arm does not show an amber light to the front (1.4.c.1b) 13 March 2006 [16:22] 13/03/2006 863832576048 863832576048
1 Offside semaphore indicator arm arm does not show an amber light to the rear (1.4.c.1b) Offside semaphore indicator arm arm does not show an amber light to the rear (1.4.c.1b) 13 March 2006 [16:22] 13/03/2006 863832576048 863832576048
1 Offside semaphore indicator arm does not retract smoothly (1.4.c.1a) Offside semaphore indicator arm does not retract smoothly (1.4.c.1a) 13 March 2006 [16:22] 13/03/2006 863832576048 863832576048
1 Brake pedal functionally incomplete (3.3.a.1a) Brake pedal functionally incomplete (3.3.a.1a) 13 March 2006 [16:22] 13/03/2006 863832576048 863832576048
1 Steering column movement between the shaft and steering wheel (2.1.2b) Steering column movement between the shaft and steering wheel (2.1.2b) 13 March 2006 [16:22] 13/03/2006 863832576048 863832576048
1 Nearside rear position lamp(s) excessively deteriorated so that it is not visible from a reasonable distance (1.1.a.3d) Nearside rear position lamp(s) excessively deteriorated so that it is not visible from a reasonable distance (1.1.a.3d) 13 March 2006 [16:22] 13/03/2006 863832576048 863832576048
1 Fuel cap/sealing device sealing washer missing (7.2.4c) Fuel cap/sealing device sealing washer missing (7.2.4c) 13 March 2006 [16:22] 13/03/2006 863832576048 863832576048
1 Nearside front shock absorber has a serious fluid leak (2.7.3) Nearside front shock absorber has a serious fluid leak (2.7.3) 13 March 2006 [16:22] 13/03/2006 863832576048 863832576048
1 Nearside steering rack gaiter split (2.2.d.2d) Nearside steering rack gaiter split (2.2.d.2d) 13 March 2006 [16:22] 13/03/2006 863832576048 863832576048
1 Offside rear leaf spring has excessive wear in a shackle pin and/or bush (2.4.b.2) Offside rear leaf spring has excessive wear in a shackle pin and/or bush (2.4.b.2) 13 March 2006 [16:22] 13/03/2006 863832576048 863832576048

ALL 323 TMU User Entered Faults [2]

ALL User Entered faults, ORDERED by OCCURRENCE DURING 323 TMU's MOT HISTORY
ALL 323 TMU User Entered Faults [2]
ALL User Entered faults, ORDERED by OCCURRENCE DURING 323 TMU's MOT HISTORY
Advisory Faults | source www.vehiclestats.co.uk
Fault Fault Test Date Test Date/Time Reference MOT Test Reference
2 Osf inner sill corroded. Nsf inner sill corroded, Osf inner sill corroded. Nsf inner sill corroded, 19 March 2012 [16:48] 19/03/2012 15 March 2012 [15:54] 15/03/2012 898779672089 898779672089 746815472031 746815472031

MOT TEST: 19 March 2012 16:48:57 PASSED
MOT TEST: 19 March 2012 16:48:57 PASSED

This test (898779672089) was completed on the 19 March 2012 16:48:57 and PASSED the requirements for a valid MOT with 2 comments.

This test (898779672089) was completed on the 19 March 2012 16:48:57 and PASSED the requirements for a valid MOT with 2 comments.

Recorded mileage: 21,578

Recorded mileage: 21,578


ADVISORY

USER ENTERED


MOT TEST: 15 March 2012 15:54:06 FAILED
MOT TEST: 15 March 2012 15:54:06 FAILED

This test (746815472031) was completed on the 15 March 2012 15:54:06 and FAILED the requirements for a valid MOT with 12 comments.

This test (746815472031) was completed on the 15 March 2012 15:54:06 and FAILED the requirements for a valid MOT with 12 comments.

Recorded mileage: 21,578

Recorded mileage: 21,578


ADVISORY

FAIL

USER ENTERED


MOT TEST: 08 October 2010 14:42:09 PASSED
MOT TEST: 08 October 2010 14:42:09 PASSED

This test (160941780295) was completed on the 08 October 2010 14:42:09 and PASSED the requirements for a valid MOT with 0 comments.

This test (160941780295) was completed on the 08 October 2010 14:42:09 and PASSED the requirements for a valid MOT with 0 comments.

Recorded mileage: 21,357

Recorded mileage: 21,357


MOT TEST: 11 April 2006 14:10:58 PASSED
MOT TEST: 11 April 2006 14:10:58 PASSED

This test (172201106134) was completed on the 11 April 2006 14:10:58 and PASSED the requirements for a valid MOT with 0 comments.

This test (172201106134) was completed on the 11 April 2006 14:10:58 and PASSED the requirements for a valid MOT with 0 comments.

Recorded mileage: 21,169

Recorded mileage: 21,169


MOT TEST: 13 March 2006 16:22:44 FAILED
MOT TEST: 13 March 2006 16:22:44 FAILED

This test (863832576048) was completed on the 13 March 2006 16:22:44 and FAILED the requirements for a valid MOT with 13 comments.

This test (863832576048) was completed on the 13 March 2006 16:22:44 and FAILED the requirements for a valid MOT with 13 comments.

Recorded mileage: 21,169

Recorded mileage: 21,169


ADVISORY

FAIL