324 DPO


324DPO is registered to a Black 1961, Morris Minor 1000 with a Petrol engine. It Passed its most recent MOT Test on the 30 October 2018

16 unique faults (17 Total) reported in its MOT History (10 Tests).

1 common/recurring faults.

70% (7) MOT Pass Rate and a 30% (3) MOT Failure Rate.

56,236 recorded miles.

324 DPO


324DPO is registered to a Black 1961, Morris Minor 1000 with a Petrol engine. It Passed its most recent MOT Test on the 30 October 2018

16 unique faults (17 Total) reported in its MOT History (10 Tests).

1 common/recurring faults.

70% (7) MOT Pass Rate and a 30% (3) MOT Failure Rate.

56,236 recorded miles.

MOT PASS/Failure rate for 324 DPO

all MOT test results for 324 DPO represented as a percentage
MOT PASS/Failure rate for 324 DPO
all MOT test results for 324 DPO represented as a percentage

PERCENTAGE OF VEHICLE FAULTS WITH 324 DPO

ALL REPORTED FAULTS, DISPLAYED BY PERCENTAGE OF OCCURRENCE DURING ALL MOT TESTS
PERCENTAGE OF VEHICLE FAULTS WITH 324 DPO
ALL REPORTED FAULTS, DISPLAYED BY PERCENTAGE OF OCCURRENCE DURING ALL MOT TESTS
ADVISORY

FAIL

324 DPO annual Faults by type

ALL REPORTED FAULTS, DISPLAYED over time and categorised by type
324 DPO annual Faults by type
ALL REPORTED FAULTS, DISPLAYED over time and categorised by type

ALL 324 DPO ADVISORIES [4]

ALL ADVISORIES, ORDERED by OCCURRENCE DURING 324 DPO's MOT HISTORY
ALL 324 DPO ADVISORIES [4]
ALL ADVISORIES, ORDERED by OCCURRENCE DURING 324 DPO's MOT HISTORY
Advisory Faults | source www.vehiclestats.co.uk
Fault Fault Test Date Test Date/Time Reference MOT Test Reference
2 Slight play rear prop uj Slight play rear prop uj 23 November 2017 [11:16] 23/11/2017 16 November 2017 [11:17] 16/11/2017 921653235109 921653235109 667013104493 667013104493
1 Brake pedal travel long [rear adjustment?] Brake pedal travel long [rear adjustment?] 30 October 2018 [14:35] 30/10/2018 565193318548 565193318548
1 Offside front wheel bearing has slight play (2.5.a.3c) Offside front wheel bearing has slight play (2.5.a.3c) 15 April 2010 [16:13] 15/04/2010 703645200186 703645200186

ALL 324 DPO Failure Faults [13]

ALL Failure faults, ORDERED by OCCURRENCE DURING 324 DPO's MOT HISTORY
ALL 324 DPO Failure Faults [13]
ALL Failure faults, ORDERED by OCCURRENCE DURING 324 DPO's MOT HISTORY
Fail Faults | source www.vehiclestats.co.uk
Fault Fault Test Date Test Date/Time Reference MOT Test Reference
1 Headlamp aim not tested (1.8.a.1c) Headlamp aim not tested (1.8.a.1c) 16 November 2017 [11:17] 16/11/2017 667013104493 667013104493
1 Headlamp not working on dipped beam both (1.7.5a) Headlamp not working on dipped beam both (1.7.5a) 16 November 2017 [11:17] 16/11/2017 667013104493 667013104493
1 Headlamp not working on main beam both (1.7.5a) Headlamp not working on main beam both (1.7.5a) 16 November 2017 [11:17] 16/11/2017 667013104493 667013104493
1 Offside rear rear brake recording little or no effort rear hub seal leaking ? (3.7.b.5a) Offside rear rear brake recording little or no effort rear hub seal leaking ? (3.7.b.5a) 16 November 2017 [11:17] 16/11/2017 667013104493 667013104493
1 Parking brake: efficiency below requirements (3.7.b.7) Parking brake: efficiency below requirements (3.7.b.7) 16 November 2017 [11:17] 16/11/2017 667013104493 667013104493
1 Rear brakes imbalanced across an axle axle 2 (3.7.b.5b) Rear brakes imbalanced across an axle axle 2 (3.7.b.5b) 16 November 2017 [11:17] 16/11/2017 667013104493 667013104493
1 Offside front wheel bearing rough when rotated (2.5.a.2) Offside front wheel bearing rough when rotated (2.5.a.2) 15 April 2010 [16:13] 15/04/2010 703645200186 703645200186
1 Nearside rear an item not tested (manual) Nearside rear an item not tested (manual) 15 April 2010 [16:13] 15/04/2010 703645200186 703645200186
1 Offside rear rear position lamp(s) excessively deteriorated so that it is not visible from a reasonable distance (1.1.a.3d) Offside rear rear position lamp(s) excessively deteriorated so that it is not visible from a reasonable distance (1.1.a.3d) 19 September 2007 [10:28] 19/09/2007 181582367258 181582367258
1 Nearside windscreen wiper does not clear the windscreen effectively (8.2.2) Nearside windscreen wiper does not clear the windscreen effectively (8.2.2) 19 September 2007 [10:28] 19/09/2007 181582367258 181582367258
1 Offside windscreen wiper does not clear the windscreen effectively (8.2.2) Offside windscreen wiper does not clear the windscreen effectively (8.2.2) 19 September 2007 [10:28] 19/09/2007 181582367258 181582367258
1 Nearside rear brake pipe excessively corroded (3.6.b.2c) Nearside rear brake pipe excessively corroded (3.6.b.2c) 19 September 2007 [10:28] 19/09/2007 181582367258 181582367258
1 Brakes imbalanced across an axle (3.7.b.5b) Brakes imbalanced across an axle (3.7.b.5b) 19 September 2007 [10:28] 19/09/2007 181582367258 181582367258

MOT TEST: 30 October 2018 14:35:08 PASSED
MOT TEST: 30 October 2018 14:35:08 PASSED

This test (565193318548) was completed on the 30 October 2018 14:35:08 and PASSED the requirements for a valid MOT with 1 comments.

This test (565193318548) was completed on the 30 October 2018 14:35:08 and PASSED the requirements for a valid MOT with 1 comments.

Recorded mileage: 56,219

Recorded mileage: 56,219


ADVISORY


MOT TEST: 23 November 2017 11:16:41 PASSED
MOT TEST: 23 November 2017 11:16:41 PASSED

This test (921653235109) was completed on the 23 November 2017 11:16:41 and PASSED the requirements for a valid MOT with 1 comments.

This test (921653235109) was completed on the 23 November 2017 11:16:41 and PASSED the requirements for a valid MOT with 1 comments.

Recorded mileage: 56,236

Recorded mileage: 56,236


ADVISORY


MOT TEST: 16 November 2017 11:17:05 FAILED
MOT TEST: 16 November 2017 11:17:05 FAILED

This test (667013104493) was completed on the 16 November 2017 11:17:05 and FAILED the requirements for a valid MOT with 7 comments.

This test (667013104493) was completed on the 16 November 2017 11:17:05 and FAILED the requirements for a valid MOT with 7 comments.

Recorded mileage: 56,219

Recorded mileage: 56,219


ADVISORY

FAIL


MOT TEST: 07 December 2015 11:37:31 PASSED
MOT TEST: 07 December 2015 11:37:31 PASSED

This test (457751475469) was completed on the 07 December 2015 11:37:31 and PASSED the requirements for a valid MOT with 0 comments.

This test (457751475469) was completed on the 07 December 2015 11:37:31 and PASSED the requirements for a valid MOT with 0 comments.

Recorded mileage: 55,853

Recorded mileage: 55,853


MOT TEST: 20 August 2011 09:52:28 PASSED
MOT TEST: 20 August 2011 09:52:28 PASSED

This test (535642731224) was completed on the 20 August 2011 09:52:28 and PASSED the requirements for a valid MOT with 0 comments.

This test (535642731224) was completed on the 20 August 2011 09:52:28 and PASSED the requirements for a valid MOT with 0 comments.

Recorded mileage: 55,817

Recorded mileage: 55,817


MOT TEST: 22 April 2010 13:26:59 PASSED
MOT TEST: 22 April 2010 13:26:59 PASSED

This test (554092410198) was completed on the 22 April 2010 13:26:59 and PASSED the requirements for a valid MOT with 0 comments.

This test (554092410198) was completed on the 22 April 2010 13:26:59 and PASSED the requirements for a valid MOT with 0 comments.

Recorded mileage: 55,692

Recorded mileage: 55,692


MOT TEST: 15 April 2010 16:13:25 FAILED
MOT TEST: 15 April 2010 16:13:25 FAILED

This test (703645200186) was completed on the 15 April 2010 16:13:25 and FAILED the requirements for a valid MOT with 3 comments.

This test (703645200186) was completed on the 15 April 2010 16:13:25 and FAILED the requirements for a valid MOT with 3 comments.

Recorded mileage: 55,689

Recorded mileage: 55,689


ADVISORY

FAIL


MOT TEST: 02 October 2007 14:30:56 PASSED
MOT TEST: 02 October 2007 14:30:56 PASSED

This test (343395177295) was completed on the 02 October 2007 14:30:56 and PASSED the requirements for a valid MOT with 0 comments.

This test (343395177295) was completed on the 02 October 2007 14:30:56 and PASSED the requirements for a valid MOT with 0 comments.

Recorded mileage: 55,291

Recorded mileage: 55,291


MOT TEST: 19 September 2007 10:28:24 FAILED
MOT TEST: 19 September 2007 10:28:24 FAILED

This test (181582367258) was completed on the 19 September 2007 10:28:24 and FAILED the requirements for a valid MOT with 5 comments.

This test (181582367258) was completed on the 19 September 2007 10:28:24 and FAILED the requirements for a valid MOT with 5 comments.

Recorded mileage: 55,291

Recorded mileage: 55,291


FAIL


MOT TEST: 26 August 2006 11:56:57 PASSED
MOT TEST: 26 August 2006 11:56:57 PASSED

This test (514128236277) was completed on the 26 August 2006 11:56:57 and PASSED the requirements for a valid MOT with 0 comments.

This test (514128236277) was completed on the 26 August 2006 11:56:57 and PASSED the requirements for a valid MOT with 0 comments.

Recorded mileage: 53,665

Recorded mileage: 53,665