335 PKO


335PKO is registered to a White 1961, Morris Minor 1000 with a Petrol engine. It Failed its most recent MOT Test on the 05 September 2014

6 unique faults (6 Total) reported in its MOT History (4 Tests).

0 common/recurring faults.

75% (3) MOT Pass Rate and a 25% (1) MOT Failure Rate.

74,686 recorded miles.

335 PKO


335PKO is registered to a White 1961, Morris Minor 1000 with a Petrol engine. It Failed its most recent MOT Test on the 05 September 2014

6 unique faults (6 Total) reported in its MOT History (4 Tests).

0 common/recurring faults.

75% (3) MOT Pass Rate and a 25% (1) MOT Failure Rate.

74,686 recorded miles.

MOT PASS/Failure rate for 335 PKO

all MOT test results for 335 PKO represented as a percentage
MOT PASS/Failure rate for 335 PKO
all MOT test results for 335 PKO represented as a percentage

PERCENTAGE OF VEHICLE FAULTS WITH 335 PKO

ALL REPORTED FAULTS, DISPLAYED BY PERCENTAGE OF OCCURRENCE DURING ALL MOT TESTS
PERCENTAGE OF VEHICLE FAULTS WITH 335 PKO
ALL REPORTED FAULTS, DISPLAYED BY PERCENTAGE OF OCCURRENCE DURING ALL MOT TESTS
ADVISORY

FAIL

335 PKO annual Faults by type

ALL REPORTED FAULTS, DISPLAYED over time and categorised by type
335 PKO annual Faults by type
ALL REPORTED FAULTS, DISPLAYED over time and categorised by type

ALL 335 PKO ADVISORIES [1]

ALL ADVISORIES, ORDERED by OCCURRENCE DURING 335 PKO's MOT HISTORY
ALL 335 PKO ADVISORIES [1]
ALL ADVISORIES, ORDERED by OCCURRENCE DURING 335 PKO's MOT HISTORY
Fail Faults | source www.vehiclestats.co.uk
Fault Fault Test Date Test Date/Time Reference MOT Test Reference
1 Service brake: service brake efficiency only just met. It would appear that the braking system requires adjustment or repair. (3.7.c.1a) Service brake: service brake efficiency only just met. It would appear that the braking system requires adjustment or repair. (3.7.c.1a) 08 August 2012 [11:44] 08/08/2012 537691722244 537691722244

ALL 335 PKO Failure Faults [5]

ALL Failure faults, ORDERED by OCCURRENCE DURING 335 PKO's MOT HISTORY
ALL 335 PKO Failure Faults [5]
ALL Failure faults, ORDERED by OCCURRENCE DURING 335 PKO's MOT HISTORY
Fail Faults | source www.vehiclestats.co.uk
Fault Fault Test Date Test Date/Time Reference MOT Test Reference
1 Nearside front lower steering pivot point has excessive play (2.2.b.1g) Nearside front lower steering pivot point has excessive play (2.2.b.1g) 08 August 2012 [11:44] 08/08/2012 537691722244 537691722244
1 Nearside front track rod end inappropriately modified (2.2.c.1e) Nearside front track rod end inappropriately modified (2.2.c.1e) 08 August 2012 [11:44] 08/08/2012 537691722244 537691722244
1 Offside front track rod end inappropriately modified (2.2.c.1e) Offside front track rod end inappropriately modified (2.2.c.1e) 08 August 2012 [11:44] 08/08/2012 537691722244 537691722244
1 Nearside rear tie bar/rod attachment bracket/mounting insecure (2.4.g.1) Nearside rear tie bar/rod attachment bracket/mounting insecure (2.4.g.1) 08 August 2012 [11:44] 08/08/2012 537691722244 537691722244
1 Offside rear tie bar/rod attachment bracket/mounting insecure (2.4.g.1) Offside rear tie bar/rod attachment bracket/mounting insecure (2.4.g.1) 08 August 2012 [11:44] 08/08/2012 537691722244 537691722244

MOT TEST: 05 September 2014 15:25:01 PASSED
MOT TEST: 05 September 2014 15:25:01 PASSED

This test (725168944219) was completed on the 05 September 2014 15:25:01 and PASSED the requirements for a valid MOT with 0 comments.

This test (725168944219) was completed on the 05 September 2014 15:25:01 and PASSED the requirements for a valid MOT with 0 comments.

Recorded mileage: 74,686

Recorded mileage: 74,686


MOT TEST: 05 September 2013 14:40:53 PASSED
MOT TEST: 05 September 2013 14:40:53 PASSED

This test (157028843295) was completed on the 05 September 2013 14:40:53 and PASSED the requirements for a valid MOT with 0 comments.

This test (157028843295) was completed on the 05 September 2013 14:40:53 and PASSED the requirements for a valid MOT with 0 comments.

Recorded mileage: 74,590

Recorded mileage: 74,590


MOT TEST: 18 August 2012 13:03:18 PASSED
MOT TEST: 18 August 2012 13:03:18 PASSED

This test (489981432299) was completed on the 18 August 2012 13:03:18 and PASSED the requirements for a valid MOT with 0 comments.

This test (489981432299) was completed on the 18 August 2012 13:03:18 and PASSED the requirements for a valid MOT with 0 comments.

Recorded mileage: 74,530

Recorded mileage: 74,530


MOT TEST: 08 August 2012 11:44:40 FAILED
MOT TEST: 08 August 2012 11:44:40 FAILED

This test (537691722244) was completed on the 08 August 2012 11:44:40 and FAILED the requirements for a valid MOT with 6 comments.

This test (537691722244) was completed on the 08 August 2012 11:44:40 and FAILED the requirements for a valid MOT with 6 comments.

Recorded mileage: 74,525

Recorded mileage: 74,525


ADVISORY

FAIL